IBM Support

Fix list for IBM UrbanCode Deploy 6.0.0.0 to 6.2.4.0

Product documentation


Abstract

This document contains a complete listing of releases, refreshes, fix packs and interim fixes sorted by version for IBM UrbanCode Deploy from version 6.0.0.0 through version 6.2.4.0.

For later versions, see the What's New document on the Developers Center. The What's new document for each version contains a fix list for that version. See the Fix List document for a cumumlative list of fixes.

Content

Tab navigation

Fixes in later versions of IBM UrbanCode Deploy can be found here. Visit the IBM Support Portal for UrbanCode Deploy to configure your support portal experience and review FAQs, lists of known problems, fixes, and a wealth of important support information.

Follow IBM Cloud Support on Twitter | devWorks Blog

Review the IBM Cloud Support BLOG article Enhance your IBM Cloud Support Experience for a complete list of the different support offerings along with a brief description on the best way to use each resource to improve your experience using IBM Cloud products and services.

Table of Contents:


Mod Pack 4 (6.2.4)
Link Date Released Status

21 March 2017

Current

APAR Description
PI77989 CORRUPTED ARTIFACTS WHEN THERE ARE MULTIPLE COPIES OF A SINGLE FILE IN A VERSION
PI77458 SHELL STEP INTERMITTENTLY FAILING WITH IMPERSONATEREXCEPTION ERROR
PI77425 AGENT UNABLE TO UPLOAD LOG DUE TO FAILURE TO CREATE DIRECTORY
PI77417 INCORRECT VOLUME IN BUZDDDEF JOB EXAMPLE
PI77047 UC AUTO DISCOVERY ROLE IS MISSING PERMISSIONS
PI76792 LARGE PROCESSES TAKE A WHILE TO LOAD IN THE PROCESS EDITOR, AND CAN CAUSE THE PAGE TO BE UNRESPONSIVE
PI76625 AUTOMATIC AGENT LICENSING LICENSES Z/OS AGENTS INCORRECTLY
PI76522 MESSAGE IN “CREATE APPLICATION FROM TEMPLATE” WIZARD IS WRONG WITH JAPANESE BROWSER
PI75682 UNABLE TO SAVE REPORT WITH THE SAME NAME AS DELETED REPORT
PI75532 UNABLE TO VIEW SUBPROCESS WITH SECURE VALUES WITHIN PROCESS REQUEST
PI75131 RESOURCE PROPERTY VALUES ARE NOT GETTING LOCKED
PI75054 PROCESS STEP PALETTE DOES NOT EXPAND ENOUGH WHEN THERE ARE A LARGE NUMBER OF PROCESS PALETTE CATEGORIES
PI75008 CANCEL BUTTON DOESN’T FULLY CANCEL A PROCESS WITH A SPLIT/JOIN
PI74598 OPTIMIZE LOADING OF PLUGINS THAT CREATE MANY RESOURCE ROLES
PI73940 PROPERTIES OF PARENT RESOURCES ARE NOT LOCKED ON SNAPSHOTS
PI73872 CREATE NETWORK RELAY” WORDING IS DEPRECATED
PI72858 DEPLOY IS NOT ABLE TO GET NEW VERSIONS FROM NEXUS
PI71669 FAILED DEPLOYMENTS SHOW AS SCHEDULED IN REPORTS
PI71061 UCDP SERVERS AND CONFIG SECTION IS DUPLICATED IN THE UCD UI FOR APPLICATION PROCESS EXECUTION
PI70161 LOCKED SNAPSHOT DEPLOYMENT MAY NOT RESPECT LOCKED ENVIRONMENT PROPERTIES
PI68819 RESTORE EMPTY ARCHIVED VERSION FAILS WITH EXCEPTION
PI68708 DEPLOYMENT HANGS WHEN MAX # OF CONCURRENT COMPONENT NOT SET TO -1
PI67279 LARGER LOGS TAKES LONGER TIME TO LOAD AND FREEZES THE BROWSER
PI60022 SCRIPT BODY TEXT ${LIBPATH} IN FILE UTILS STEP CREATE FILE IS RESOLVED TO A VALUE INSTEAD OF BEING IGNORED
PI58738 ISSUES WITH APPLICATION ENVIRONMENT BLUEPRINTS MISBEHAVE WHEN NAME IS NOT UNIQUE
PI45413 Issues installing on AIX 7.1 PPC64
PI38427 ISSUES WITH AGENT INSTALLER ENCODING FILES
PI28680 ISSUES IMPORTING FROM TAGS USING SUBVERSION SOURCE PLUGIN

Fix Pack 1 (6.2.3)
Link Date Released Status

13 February 2017

Superseded

APAR Description
PI35408 AGENTS REMAIN IN CONNECTING STATUS AFTER NETWORK INTERRUPTION
PI46226 WEBSPHERE DISCOVERY DOES NOT USE IMPERSONATION ON FIRST RUN
PI58671 UCD PROPERTIES BATCH EDIT MODE DOES NOT ACCEPT PROPERTY VALUES THAT CONTAIN CR/LF
PI59892 "AN ERROR HAS OCCURRED" ON CONFIGURATION TAB
PI62937 FLOATING LICENSES NOT BEING RETURNED AFTER 30 MINUTES
PI66683 VERSION IMPORT LOG CONTINUES REFRESHING AFTER IT COMPLETES
PI67252 DASHBOARD PAGE IS SLOW TO LOAD EVEN IF NO PROCESSES ARE RUNNING
PI67442 CLI CAN TURN A COMPONENT RESOURCE INTO A GROUP RESOURCE
PI67708 "AGENT PROTOTYPES ARE NOT FILLED IN CORRECTLY WHEN CREATING AN ENVIRONMENT FOR NON-ADMIN USER"
PI67762 PLUGIN COMMAND TOKENS ARE CLEANED UP IMPROPERLY
PI68705 AGENT RELAY ATTEMPTS TO BACK UP CODESTATION CACHE ON UPGRADE
PI70096 "CREATE ENVIRONMENT TEMPLATE FORM SHOWS DELETED ENVIRONMENT SECURITY TYPES"
PI70605 AUTO-LAYOUT FLAG IS NOT PRESERVED WHEN IMPORTING PROCESS
PI71191 "COPY AND SAVE OF COMPONENTS IS NOT WORKING WHEN THE SOURCE COMPONENT IS A TEMPLATE WITH EAR, JAR OR WAR FILE"
PI71699 "NO WAY TO OVERRIDE AN APPLICATION PROPERTY DEFINED ON AN APPLICATION TEMPLATE FROM THE REST API"
PI72961 WEEKLY DEPLOYMENT REPORT DOES NOT SHOW DATA
PI72962 MAX NUMBER OF CONCURRENT COMPONENTS NEEDS BETTER NAME
PI72963 MAX NUMBER OF CONCURRENT JOBS NEEDS BETTER NAME IN UI
PI73691 "DIAGNOSTICS BUNDLE INCLUDES ALL FILES FROM BIN DIRECTORY INCLUDING HEAPDUMPS"
PI73872 "CREATE NETWORK RELAY" WORDING IS DEPRECATED
PI74168 "FAILED IMPORTS THOUGH UCD CAN CAUSE ARTIFACTS TO REMAIN AND USE DISK SPACE UNNECESSARILY"
PI74577 UNLOCK USER EVENT NOT LOGGED IN AUDIT LOGS
PI74589 "SET PROCESS REQUEST PROPERTY STEP FAILS WITH ERROR: ""JAVA.IO.IOE XCEPTION: 400 BAD REQUEST NO PROCESSREQUEST EXISTS WITH ID"
PI74926 "AGENTS HAVE INCORRECT STATUES OR EXPERIENCE CONNECTIVITY PROBLEMS"

Mod Pack 3 (6.2.3)
Link Date Released Status

20 December 2016

Superseded

APAR Description
PI63069 Various classes need to be more thoroughly tested
PI43022 The Deployment Reports do not match the date when the deployment process was actually run
PI39853 "Output File" property of Shell step results in NullPointerException
PI45310 STARTUP FAILS IF KEY PASSWORD DIFFERS FROM KEYSTORE PASSWORD
PI47808 Deleted component process still runs
PI51215 Generic process step in application process has wrong status
PI58103 Windows Impersonation Fails when Impersonated User is not an Administrator
PI59438 COPYING STEPS TO CLIPBOARD FAILS WHEN SOME CHARACTERS ARE PRESENT IN STEP NAME/FIELDS
PI60035 LOGS SOMETIMES ARE NOT UPLOADED TO UCD FROM AGENTS, OR ARE OVERWRITTEN WITH EMPTY LOGS.
PI60838 Versions not correctly set on processes requested from the REST API or CLI
PI62544 IPAS parameter that are locked should not be editable in UCD
PI67142 Agent is generating case-matching errors in log
PI68185 Versions deployed to deleted environments are not cleaned up
PI56388 Non-System Admin User Cannot Create Environment From Blueprint and Resource Template
PI56486 tag filter works differently when selecting base resources
PI68825 inactive component processes exported with component.
PI68985 User can run component process on agent without agent view permissions
PI69132 Agent installer does not always use non-default temp directory during silent install
PI69219 Creating a Component Property Definition with no default value results on the PropDef not being propagated to components.
PI69701 Modify WADL generator to support JSON array template
PI69819 Creating an application process through the CLI (or process step) does not use version presets
PI70009 ${p:allProperties} is not escaped properly
PI70252 Cannot upgrade an application with a snapshot with a locked component version
PI70449 BUZTOOL JCL: CREATE INCREMENTAL ZOSVERSION PASSES NO RC CODE BACK
PI70469 CANNOT CONFIGURE A SEPARATE CERTIFICATE FOR MUTUAL AUTHENTICATION ON RELAY
PI70811 Null Pointer Exception running deleted component template processes
PI70950 TEXTAREAS FOR COMPONENT TEMPLATE PROCESS PROPERTIES ARE NOT EDITABLE IN THE PROCESS EDITOR
PI71683 User set to null when running 'Add Resource Inventory Status' step
PI71694 Automatic version imports stuck in waiting
PI72036 User without access to the Settings page no longer has read access to postprocessing scripts, which leads to an error in the UI when editing a process step
PI72263 Null pointer on application import when new template is defined in import
PI72604 UCD 622 - Dataset Allocation problem when space in component name
PI72702 invalid patterns integration prevents use of application processes
PI72878 Update installation to disable Relay Dead Letter Queue by default
-- This release contains fixes for security vulnerabilities. Review the following security bulletins for more details:

Mod Pack 2 (6.2.2.1)
Link Date Released Status

21 November 2016

Superseded

APAR Description
PI71694 AUTOMATIC VERSION IMPORTS STUCK IN WAITING
PI71683 USER SET TO NULL WHEN RUNNING ‘ADD RESOURCE INVENTORY STATUS STEP
PI70531 “INSTALL TEMPLATE” STEP IN IBM URBANCODE DEPLOY CONFIGURATION MANAGEMENT PLUGIN THROWS 403 ERROR
PI67605 UNABLE TO VIEW POST PROCESSING SCRIPT WITHOUT PERMISSION TO VIEW THE SETTINGS TAB
PI69981 URBANCODE DEPLOY BLUEPRINT DESIGNER USER INTERFACE MAY NOT SHOW AUTOSCALE INSTANCES PROVISIONED


Mod Pack 2 (6.2.2)
Link Date Released Status

20 September 2016

Superseded

APAR Description
PI67005 Iteration properties in the for each agent step are not immediately resolving
PI67104 Locked Processes ignored with snapshot deployments
PI67226 Resource Compare/Apply Changes hangs
PI67605 Component cleanup creates achive files erroneously
PI67931 zOS Utility v17 step Deploy Package fails with IRX0013I Error running BUZBKPZP, line 994: Invalid character in program
PI69043 ResourceSyncService should not sync deleted environments
PI69164 Run generic process steps can fail unexpectedly but still run.
PI24455 FIRST START FAILS WITH FAILED TO START IBM URBANCODE DEPLOY: COM.SUN.CRYPTO.PROVIDER.SEALEDOBJECTFORKEYPROTECTOR
PI35295 Unable to delete type configurations
PI37581 It is possible to import component templates from old versions resulting in errors restoring objects from vc_persistent_record
PI39002 UPGRADING UCD TO 6.1.1.3 PRINTS MISLEADING MESSAGE ABOUT JRE USED
PI48885 Reset Latest to This Version does not prompt for a comment if comment is required
PI55273 udclient gives unhelpful error when creating component with incorrect name for template
PI56388 Poor error message for cyclic process steps when importing
PI56486 Deploying incremental versions leads to wrong snapshot in environment inventory view
PI58327 Cannot edit a component's basic settings: User does not have read permission
PI63824 Unable to edit or delete property definition
PI61693 Security reports query large amounts of data
PI62426 Cannot change component version properties once deployed.
PI62368 Adding thousands of components to a resource tree times out
PI62602 Environment is not correctly created if based on resource template with special characters
PI62821 Agent installation failed when using the IBMJCECCA hardware cryptograph driver
PI64554 Component Template Versions Increasing without Changes
PI64845 lastResendTime in PluginTaskRequest should be declared as Long instead of long
PI66760 File not found exception on the agent during log upload causes an empty log file to be uploaded to the server
PI64901 UCD v6.2.1.0ifix01:ComponentTemplate (Component Template Versions Increasing without Changes)
PI65002 UnrecoverableKeyException on agent startup when installed via UI
PI65004 ERROR ON BATCH EDIT WHEN HAVE MULTIPLE LINES
PI65095 Incorrect Template Property Propagation
PI65111 CLI COMMAND DOES NOT WORK WHEN NAME PARAMETER LONGER THAN 35 CHARACTERS in DB2
PI65546 TRIM ON COMPONENT PROCESS NAME IS CAUSING COLLISION ON SOME APPLICATION IMPORTS
PI65547 Component inventory update step fails to remove desired inventory with NullPointerException
PI65557 Process Request Started notification template shows unresolved property for version when process includes operational (non-version) step
PI65647 During an Application export, a 'No ResourceRole exists with ID' error occurs
PI65742 Environment shows as noncompliant if user does not have full permissions
PI66002 NOT POSSIBLE TO DELETE A RESOURCE TEMPLATE THAT HAD A CHILD BLUEPRINT IN A DELETED APPLICATION
PI65804 Copying an environment with environment template does not disable / gray out template assiged fields
PI66436 Importing component templates is modifying Component Property Definitions
PI68747 Codestation geo tag (version status) escaping does not escape ':', ';', or '\'
PI66563 Version import AuthTokens not cleaned up
PI66647 Need to default missing templateName on Manual Tasks during importing of Applications
PI66754 Unable to view component template process in components inherited from template
PI66758 Import Application with snapshot fails to import on different os than the server is running on.

Fix Pack 2 (6.2.1.2)
Link Date Released Status

1 July 2016

Superseded

APAR Description
PI64454 CREATE A NEW RESOURCE FROM TEMPLATE UNDER RESOURCE TREE SHOWS BLUEPRINTS IN DROPDOWN
PI64146 INCORRECT DIR BLOCKS FOR TEMP DATA SET DURING BACKUP
PI63474 PERFORMANCE DELAYS LOADING RESOURCE TREE
PI62232 ADDING THOUSANDS OF RESOURCES VIA THE CLI TIMES OUT
PI62000 CANNOT SET IMPERSONATION ON AGENT
PI61627 MAX CONCURRENT JOBS NOT WORKING CORRECTLY FOR APPLICATIONS BASED ON TEMPLATES
PI61564 SERVICE TO GET ENTIRE TREE FOR A GIVEN RESOURCE
PI61508 UI SHOWS STOP AND PAUSE BUTTONS WHEN USER DOES NOT HAVE PERMISSIONS
PI61220 WINDOWS SERVICE DOES NOT START AGENT RELAY
PI60873 UPGRADE UCD TO 6.2.1 FAILS DUE TO INDEX CREATION FAILURE USING SQL SERVER
PI60522 SERVICE PASSWORD NOT VALID FOR WINRS AGENT INSTALLS
PI62043 SERVICE NAME AND SERVICE USER SWITCHED WHEN CONFIGURING WINRS AGENT INSTALLS
PI59900 COPYING AN ENVIRONMENT DOES NOT COPY ITS DEPENDENCE ON A TEMPLATE
PI59555 CANNOT EXPORT APPLICATION AFTER COMPONENT HAS BEEN DELETED
PI59403 CANNOT CHANGE DESCRIPTION OF ENVIRONMENT WHEN USING APPLICATION WITH ENVIRONMENT TEMPLATES
PI59190 UNABLE TO RUN AGENTS AS WINDOWS SERVICES
PI58695 RELOADING OF STEP OUTPUT LOG DOES NOT STOP AFTER STEP FINISHES
PI55698 ISSUES WITH SERVER SHUTDOWN WHEN TRYING TO STOP THE RESOURCE SYNC SERVICE
PI55374 INSTALLING SOME PLUGINS REQUIRE SPECIAL USER PERMISSIONS
PI55273 UNCLEAR ERROR MESSAGE FROM UDCLIENT WHEN CREATING COMPONENT WITH NON-EXISTING TEMPLATE
PI53541 NO WARNING WHEN CHANGING COMPONENT VERSION PROPERTY AFTER DEPLOYMENT IF VERSION INTEGRITY IS ENABLED
PI52491 DELAYS SELECTING AN APPLICATION PROCESS
PI51623 UNABLE TO USE UPDATE USER BUTTON TO SYNC WITH LDAP
PI51230 DEFAULT HEAP SPACE SHOULD BE INCREASED FOR JAVA_OPTS IN SET_ENV
PI50946 DEFAULT PARAMETERS NOT OVERRIDDEN WHEN PROVISIONING A VSYS.NEXT PATTERN
PI49786 SPECIFYING TEXT FILE EXTENSIONS PROPERTY DOES NOT HANDLE . CHARACTER
PI61063 LARGE DEPLOYMENTS CONSUME MEMORY
PI48217 APPROVAL FAILED NOTIFICATION NOT SENT WHEN APPROVAL IS REJECTED DURING PARALLEL APPROVALS
PI47839 UNABLE TO ADD VERSIONS TO SNAPSHOT AFTER REMOVING A COMPONENT FROM AN APPLICATION
PI47748 COPIED COMPONENT OVERRIDES TEMPLATE PROPERTY VALUES
PI47563 UCD EXECUTION TREE REFRESHES THE ENTIRE TREE INSTEAD OF JUST UPDATED STEPS
PI47085 MISLEADING ERROR MESSAGE SHOWN WHEN COMPONENT TEMPLATE PROCESS CANNOT BE CREATED
PI45102 CANCEL DURING CREATION OF FILTERED RESOURCES SHOWS UNFILTERED RESOURCES
PI45093 CALENDAR ENTRIES FROM DELETED REQUESTS STILL DISPLAY ON THE MAIN CALENDAR
PI42940 PERFORMANCE DELAYS DURING BATCH COPY, MOVE, CREATE AND DELETE OPERATIONS FOR LARGE DATA SETS
PI41746 DISPLAY ISSUES WITH USERS AND GROUPS WITH LARGE AMOUNTS OF ENTRIES
PI40728 XARGS PROCESS STEP SHOWS INCONSISTENT ARGUMENT MESSAGE
PI40105 RESOURCE FILTER IS RESET AFTER USING CREATE RESOURCE DIALOG
PI39071 WARNING ERROR MESSAGES INCORRECTLY DISPLAYED IN LOGS
PI36429 WHEN DELETING A COMPONENT VERSION, THE RESOURCES HOLDING THAT COMPONENT VERSION DO NOT HAVE THE FULL PATH
PI35037 ORA-00001: UNIQUE CONSTRAINT (ECD.DS_VER_STATUS_UCI) VIOLATED:WHEN ATTEMPTING TO ASSIGN A STATUS TO A VERSION
PI32110 LDAP USER IMPORT FAILS TO IMPORT THE USERS
PI30812 ENTRY AND PROCESS FILTERS SHOW NO OPTIONS
PI30002 ISSUES WITH COMPONENTS INHERITING COMPONENT TEMPLATE SECURE PROPERTIES
PI29716 SPECIFYING AN LDAP "USER DS PATTERN" PREVENTS IMPORTING USERS
PI27905 RESOURCE TEMPLATE EDIT PAGE LOOKS TOO SIMILAR TO RESOURCE EDIT PAGE
PI26949 EXPORTING COMPONENT PROCESS WITH A MANUAL TASK ACTIVITY CAUSES ERROR
PI25305 LOGS BEING FILLED WITH "DIALOGUE NOT FOUND" MESSAGE
PI59190 UNABLE TO RUN AGENTS AS WINDOWS SERVICES
PI60734 HIGH CPU SPIKE AFTER STACK HAS FAILED

Fix Pack 1 (6.2.1.1)
Link Date Released Status

26 May 2016

Superseded

APAR Description
PI31929 SECURITY CERTIFICATES FOR UCD ARE GENERATED FOR LOCALHOST
PI47557 SNAPSHOT CANNOT LOCK COMPONENT TEMPLATE PROCESS
PI48639 APPLICATION PROCESS LIST IN THE RUN APPLICATION PROCESS DIALOG DISPLAYS INCORRECT RESULTS
PI52589 NO FEEDBACK GIVEN WHEN UCD WEB APPLICATION IS LOADING PAGES
PI53967 VERSION IMPORTS GET STUCK IN WAITING STATUS CONTINUALLY
PI54335 PERFORMANCE DELAYS LOADING ENVIRONMENT RESOURCE TREE
PI54420 CREATING A RESOURCE THEN USING THE BATCH UPDATE WITH THE RESOURCE ID CAN CAUSE BATCH CREATION ON A DIFFERENT RESOURCE
PI55333 DEPLOYMENTS DO NOT START WHEN 2K+ AGENTS ARE CONNECTED DIRECTLY TO SERVER
PI55334 THE DS_AUDIT_REQUEST_ENTRY TABLE IS NEVER CLEANED UP IN THE DATABASE
PI55829 INCORRECT DEFAULT VALUE OF DATETIME APPLICATION PROCESS PROPERTY
PI56832 DEPLOYMENT REPORTS SHOW "AN ERROR HAS OCCURRED"
PI57167 LDAP ERRORS FROM AUTH TOKEN USER AUTHENTICATION ATTEMPTS POLLUTE OUTPUT LOG
PI57764 ISSUES WITH NESTED COMPONENT PROCESSES REPORTING BLANK PROPERTIES IN A SNAPSHOT
PI57866 CHANGING DEFAULT PROPERTY IN APPLICATION OR ENVIRONMENT TEMPLATE DOES NOT CHANGE PROPERTY IN APPLICATION OR ENVIRONMENT
PI58064 JOBS SHOW ON DASHBOARD WITH ERRORS
PI58167 AGENTS APPEAR OFFLINE BUT CONNECTION TESTS PASS WHEN CONTACTING AGENT RELAY FROM SERVER BY USING NETWORK RELAY
PI58344 ENVIRONMENT CLEANUP SETTINGS NOT APPLIED DURING CLEANUP
PI58583 UNABLE TO DELETE RESOURCE TEMPLATE MAPPED WITH DELETED ENVIRONMENT TEMPLATE
PI58860 ERRORS DURING RESTORE OF ALL COMPONENT PROCESSES
PI60596 UNABLE TO RUN UCD SERVER AS A WINDOWS SERVICE
PI60964 FLOATING LICENSES REMAIN CHECKED OUT IN HA ENVIRONMENT
PI61624 INCORRECT INFORMATION FOR COMPONENT USAGE TAB
PI56739 SERVER SHOULD RETURN 404 WHEN A USER IS NOT FOUND VIA THE REST API
PI56408 CANCELLATION OF INSTALL MULTIPLE ONLY CANCELS CURRENT INSTALLATION
PI45948 SET ENVIRONMENT PROPERTY STEP MAY FAIL IF RUN SIMULTANEOUSLY
PI57738 INCORRECT INFORMATION IN UI REMOTE AGENT INSTALLATION PROPERTIES HOST HELP
PI56418 NO TIMEOUT FOR EMAIL NOTIFICATIONS CAN CAUSE UCD TO HANG AT SHUTDOWN OR WHILE SENDING EMAILS
PI55032 PATTERNS AREN’T USED IN APPLICATION PROCESS HTTP
PI36311 NO COMMON SSL PROTOCOLS BETWEEN AGENT, RELAY AND SERVER WHEN USING JAVA PACKAGED WITH INSTALLER
-- This release contains fixes for security vulnerabilities. Review the following security bulletins for more details:

Interim Fix 1 (6.2.1_iFix001)
Link Date Released Status

31 March 2016

Superseded

APAR Description
-- This release contains a fix for an issue with slow page load times of application environment compliance data for certain configurations.

Mod Pack 1 (6.2.1)
Link Date Released Status

25 February 2016

Superseded

APAR Description
PI34108 AGENT STARTUP SCRIPT DOES NOT SPECIFY MAXIMUM HEAP MEMORY FOR THE AGENTMONITOR PROCESS
PI35530 SLOW PERFORMANCE WHEN REQUESTING APPLICATION DEPLOYMENT WITH MANY COMPONENTS
PI47557 SNAPSHOT CANNOT LOCK COMPONENT TEMPLATE PROCESS
PI47833 APPLICATION PROCESS TRIGGERING TWICE ON VERSION IMPORT
PI50580 DEPLOYMENTS CAN BE RUN WITHOUT REQUIRED PROPERTIES
PI51080 IN URBANCODE DEPLOY IPAS INTEGRATION, GENERATED AGENT NAME CONVERTS CERTAIN CHARACTERS TO UNDERSCORES
PI52485 LARGE NUMBERS OF AGENTS MAY NOT GET PAST "CONNECTED" IF A SINGLE AGENT FAILS IP VALIDATION
PI53683 UNCLEAR ERROR MESSAGE WHEN A BAD RESOURCE PATH IS PASSED TO A GENERIC PROCESS
PI53812 CREATING COMPONENT RESOURCES THROUGH THE RESOURCES PLUGIN OR UDCLIENT CAN RESULT IN 'COMPONENT NOT MAPPED'
PI54035 ISSUES WITH REMOVE DESIRED INVENTORY SERVICE REST CALL
PI54211 APPLICATION PROCESS STARTS EVEN IF THE AGENT IS OFFLINE AND THE PROCESS FINISHES WITH SUCCESS STATUS
PI54608 AUTH TOKENS ARE NOT SEARCHABLE IN THE UI
PI54632 ISSUES USING IMPORT OF "UNINSTALL MULTIPLE COMPONENTS"
PI54737 PERFORMANCE DELAYS WITH URBANCODE DEPLOY SERVER DUE TO LDAP
PI54863 CANNOT IMPORT COMPONENTS WHEN A PROPERTY NAME OVERRIDES A COMPONENT TEMPLATE
PI54948 ENVIRONMENT COMPLIANCY REPORTS SLOW
PI54954 PERFORMANCE DELAYS WHEN LOADING RESOURCE TREE PAGE
PI55272 CANNOT IMPORT AN APPLICATION WHERE 'RUN IF COMPONENTS CHANGE' DOES NOT SPECIFY A COMPONENT
PI55817 DAST TOOLS REPORT ERRORS WHEN RUN AGAINST URBANCODE DEPLOY
PI55935 KEEP ME LOGGED IN BUTTON NOT FUNCTIONING

Interim Fix 1 (6.2.0.2_iFix001)
Link Date Released Status

22 January 2016

Superseded

APAR Description
PI55747 INSTALLATION FAILS WHEN UPGRADING FROM PRE-6.1.1.5 TO 6.2.0.2

Fix Pack 2 (6.2.0.2)
Link Date Released Status

17 December 2015

Superseded

APAR Description
--

This release contains a fix for a security vulnerability. Review Security Bulletin: Multiple XSS Vulnerabilities in IBM UrbanCode Deploy (CVE-2015-7415) for more details.

PI35697 ENVIRONMENT COMPARE FILE DIFFERENCE DOES NOT SHOW CORRECT RESULTS
PI37889 GENERIC PROCESS REQUEST STARTED NOTIFICATION MISSING DATA
PI50946 DEFAULT PARAMETERS NOT OVERRIDDEN WHEN PROVISIONING A VSYS.NEXT PATTERN
PI41304 UNABLE TO SEE PLUGIN STEP OUTPUT WHEN THE AGENT CHANGES ENCODING BEFORE UPLOAD
PI42049 PERFORMANCE DELAYS WHEN EDITING DEFAULT VALUES FOR PROPERTY DEFINITIONS
PI42102 ROLLBACK USING "REPLACE WITH LAST DEPLOYED" REINSTALLS INCREMENTAL VERSIONS IN WRONG ORDER
PI43232 ORACLE ERROR "MAXIMUM NUMBER OF EXPRESSIONS IN A LIST IS 1000" WHEN RUNNING REPORTS
PI46081 PLUGIN STEP FAILS WITH NPE WHEN USING IMPERSONATION AFTER UPGRADE
PI47018 PERFORMANCE DELAYS WITH DATA RETRIEVAL OF SECURITY CONFIGURATIONS OR RESOURCES
PI47380 NETWORKING FAILURES DURING UPGRADE TO 6.1.1.7
PI47479 PLUGINS FAIL AFTER UCD URL CHANGES
PI48512 SPACES IN INSTALLED.PROPERTIES FROM PROPERTY VALUES CAUSE ERRORS
PI49350 UNABLE TO EXPORT A REPORT INCLUDING MULTIPLE APPLICATIONS
PI49454 CANCELING VERSION IMPORT DOES NOT CAUSE NEXT VERSION IMPORT TO BE STARTED
PI49565 CREATING AN ENVIRONMENT FROM A BLUEPRINT FAILS WITH SQL ERROR SQLSTATE=22018
PI50051 CANNOT DISTINGUISH BETWEEN MULTIPLE VERSIONS OF PATTERNS IN UCD-IPAS INTEGRATION
PI50127 PERFORMANCE ISSUES WHEN EDITING A PROCESS STEP WITH MANY PROPERTIES
PI50304 OFFLINE AGENTS PASS CONNECTIVITY TEST AND CAN BE RESTARTED
PI50792 HIGH SERVER CPU CAUSED BY AGENT RELAY ARTIFACT CACHING
PI51084 HIGH CPU USAGE WHEN ACCESSING ENVIRONMENT RESOURCE TREE
PI51601 AGENT RELAY CANNOT BE UPDATED WHEN KEYSTORE PROPERTIES ARE SET
PI51893 UNABLE TO SET AGENT INSTALL COMPONENT ON AGENTS USING TAGS
PI52147 UNABLE TO USE SILENT INSTALL TO SET UP HIGH AVAILABILITY SERVER
PI52611 SLOW PERFORMANCE OF SNAPSHOT COMPONENT VERSION PAGE
PI52651 SECURE DEFAULT PROPERTIES IN CLOUD INTEGRATIONS ARE OVERWRITTEN
PI53088 RABBIT.CONF.TEMPLATE IS MISSING SECTIONS THAT IS CAUSING MESSAGES TO PRINT IN RELAY LOG
PI53325 ERRORS CREATING OBJECTS IN UCD
PI53939 PREVIEWING SNAPSHOTS CAN NOT SHOW CHANGES PER COMPONENT AND CHANGES PER RESOURCE
PI53427 IMAGE PALETTE HANGS WHEN WEB BROWSER IS REFRESHED
PI53396 PERFORMANCE ISSUES DUE TO DISPLAYING BLUEPRINTS IN DEPLOYMENT SEQUENCE DIALOG
PI53346 ATTEMPTS TO APPLY A FLAVOR CHANGE ON THE EXISTING OPENSTACK VM USING UCD 6.2 WITH EXTENDED HEAT ENGINE RESULT IN DATA LOSS
PI53224 ATTEMPTS TO INSTALL UCD DESIGN SERVER 6.2 ON MYSQL 5.7.9 RESULT IN FAILURE
PI53118 UNAUTHORIZED ERROR WHILE USING THE UCD BLUEPRINT DESIGNER
PI53226 UNABLE TO APPLY BLUEPRINT TO AN EXISTING ENVIRONMENT DUE TO BLANK DROPDOWN LIST OF ENVIRONMENT FIELD
PI53346 INCORRECT ERROR MESSAGE WHEN CONFIGURING UCD WITH OPENSTACK AND AWS
PI51793 BLUEPRINTS AGENT WILL NOT START WITH INSTALL-SERVICE PARAMETER
PI46810 BLUEPRINT VALIDATOR COULD NOT PICKUP OPENSTACK AND IBM RESOURCES
PI51079 BLUEPRINT PROVISIONING EXECUTES UCD PROCESSES IN SEQUENCE AND NOT IN PARALLEL
PI51076 As a user of the blueprints functionality, we need to be able to provision a vm to a specific folder
PI50864 BLUEPRINT AUTOMATICALLY RE-OPENS WHEN CLOSED
PI50113 CANNOT RESIZE VMWARE DISK IMAGE WITH WEB DESIGNER
PI46810 UCDP DESIGNER VALIDATOR NEEDS TO PROVIDE A WARNING IF THE 'NAME' PROPERTY HAS A '.'
PI48886 The network id selector in the UCDP "provision" dialog does not display the vlan id number
PI46808 UNABLE TO TEST CONNECTION TO AWS USING TEST CONNECTION
PI47336 Example of using java and other programming languages to call UCDP REST API
PI53427 NETWORK PALETTE DOES NOT DISPLAY AVAILABLE SL VLANS

Fix Pack 1 (6.2.0.1)
Link Date Released Status

24 November 2015

Superseded


Release 2 (6.2)
Link Date Released Status

29 October 2015

Current

APAR Description
PI48403 COMPONENT PROCESS TO BE RUN RESETS TO FIRST PROCESS IN LIST IN THE UI
PI49168 AGENTS FAIL TO CONNECT TO SERVER WITH "NO CIPHER SUITES IN COMMON" ERRORS IN THE LOGS (INCOMPATIBLE WITH IBM JAVA)
PI46038 ENVIRONMENT COMPLIANCE INFORMATION LOAD TIME AND PERFORMANCE ISSUES
PI37987 AGENT UPGRADE ADDS A STARTUP AND INIT SCRIPTS BUT DOES NOT LINK THE OLD ONES
PI45772 UNABLE TO UPDATE EXISTING APPLICATION PROCESS WITH CLI COMMAND
PI45099 ISSUES AFTER UPGRADING PLUGIN STEP TO REMOVE PROPERTY WITH DEFAULT VALUE
PI47209 CANNOT VIEW ADD RESOURCE ROLES FROM ENVIRONMENT RESOURCE TREE
PI45398 CHANGING RESOURCE PARENT DOES NOT CHANGE INHERITED TEAMS
PI19546 IMPORT VERSION WITH TEMPLATE GIVES "ERROR CREATING NEW VERSION: NULL"
PI47033 REST API FOR RESOURCES RETURNS DUPLICATE RESOURCES
PI43904 COMPONENT TAGS DO NOT GET IMPORTED OR EXPORTED
PI46169 LDAP CONNECTIONS ARE NOT BEING RELEASED AFTER BINDS
PI45312 COMPONENT CALENDARS NOT SHOWING ANY ENTRIES
PI36521 NO FEEDBACK WHEN IMPORTING USERS INTO AN LDAP AUTHENTICATION REALM FAILS
PI42574 "INCLUDE AGENTS AUTOMATICALLY" FUNCTIONS WITHOUT AGENT ON TEAM
PI47280 COMPONENT VERSION CLI SERVICE PERFORMANCE
PI41860 IMPERSONATION SETTINGS IGNORED ON AGENT PROTOTYPES
PI47837 PERFORMANCE ISSUES DUE TO DIALOG CACHING
PI20708 AGENT INIT SCRIPT DOES NOT WORK IF 2 AGENTS ARE INSTALLED ON THE SAME MACHINE
PI49325 SILENT AGENT INSTALLATION UNABLE TO HANDLE MULTIPLE URIS WHEN SET FOR BROKERURL
PI45938 ADD STATUS TO VERSION MAY FAIL IF RUN SIMULTANEOUSLY
PI48810 SQL ERROR DURING CLEAN UP OF AUDIT LOGS WITH DB2
PI48434 COMPONENT TEMPLATE EXPORT (IMPORT) DOES NOT INCLUDE JSON DATA FOR RESOURCE PROPERTY DEFINITIONS
PI46272 INCORRECT TITLE FOR MULTIPLE-APPLICATION REPORTS
PI36431 COMPONENT VERSIONS ASSOCIATED WITH A SNAPSHOT CANNOT BE DELETED, EVEN IF THE SNAPSHOT IS DELETED AND WAS NEVER DEPLOYED
PI47579 PROBLEMS WITH ENCODING SPECIAL CHARACTERS IN UDEPLOYRESTCLIENT
PI47021 USER FIELDS ARE BEING CLEARED VIA THE CLI RESOURCE WHEN NOT PRESENT IN SUBMITTED JSON DATA
PI40597 ISSUES WITH AGENT LICENSES BEING RELEASED WHEN DELETING AN AGENT
PI46073 PERFORMANCE ISSUES WITH MYSQL DATABASE
PI42227 UNABLE TO VIEW ARTIFACTS DUE TO PAGES CONTAINING ENCODED BACKSLASHES
PI36696 SILENT AGENT INSTALL WITH MULTIPLE AGENT RELAYS SETS THE SECOND AGENT RELAY TO NULL
PI33748 AGENT RELAY PROPERTIES INVOLVING KEYSTORES ARE NOT WELL DOCUMENTED
PI51309 EXAMPLE FOR ADDGROUPTOTEAM REFERS TO TYPE INSTEAD OF ROLE
PI49468 MISSING DOCUMENTATION ON ADDING SERVERS TO HIGH AVAILABILITY CLUSTERS
PI50510 MISSING INFORMATION ON HOW TO RELOCATE CODESTATION WITH APPDATA DIR
PI49816 MISSING INFORMATION ON RESOURCE TARGETS

Table of Contents:


Fix Pack 3 (6.1.3.5)
Link Date Released Status

28 February 2017

Current

APAR Description
--

This release contains fixes for security vulnerabilities. Review the following security bulletins for more details:


Fix Pack 3 (6.1.3.3)
Link Date Released Status

4 June 2016

Superseded


Fix Pack 2 (6.1.3.2)
Link Date Released Status

21 December 2015

Superseded

APAR Description
--

This release contains a fix for a security vulnerability. Review Security Bulletin: Multiple XSS Vulnerabilities in IBM UrbanCode Deploy (CVE-2015-7415) for more details.


Fix Pack 1 (6.1.3.1)
Link Date Released Status

30 November 2015

Superseded


Interim Fix 2 (6.1.1.8_iFix002)
Link Date Released Status

25 September 2015

Superseded

APAR Description
PI48403 COMPONENT PROCESS TO BE RUN RESETS TO FIRST PROCESS IN LIST IN THE UI

Interim Fix 1 (6.1.1.8_iFix001)
Status

Cancelled


Mod Pack 3 (6.1.3)
Link Date Released Status

10 September 2015

Superseded

APAR Description
PI39169 ISSUES STARTING AGENT RELAY SERVICE ON WINDOWS WITH IBM JVM
PI46039 PROCESS FAILS IF “RUN IF COMPONENTS CHANGE” IS CHECKED
PI45481 UNUSED TAGLIB CAUSES ERROR ON LOGIN
PI44379 APPLICATION PROCESS DESIGN EDITOR DOES NOT PROPERLY DISPLAY COMPONENTS WITH NAMES THAT CONTAIN THE CHARACTERS ‘]’ AND ‘[‘
PI45953 UPGRADE OF PLUGIN RENAMES STEPS WITH SAME NAMES
PI47202 DATABASE MIGRATION SCRIPT FAILS
PI46706 INCONSISTENT RESULTS DURING COMPONENT VERSION DOWNLOADS
PI46557 PERFORMANCE DELAYS DISPLAYING CONFIGURATION TAB TREE
PI43268 INCORRECT SORTING OF ENVIRONMENT PROPERTIES LIST
PI45937 ERROR WHEN RUNNING UCD INSTALLATION SCRIPT
PI44605 INCORRECT FILTER FUNCTIONALITY WHEN SELECTING TEAMS IN UI
PI46451 HIGH CPU ASSOCIATED WITH BACKGROUND RESOURCE SYNC SERVICE
PI44952 COMPONENT AND RESOURCE PROPERTIES NOT RESOLVING IN COMPONENT PROCESS PROPERTY DEFINITIONS
PI46644 A MISSING COMPONENT PROCESS SELECTION IN A RUN COMPONENT PROCESS STEP PREVENTS DEPLOYMENTS
PI36759 UDCLIENT INSTALLED AUTOMATICALLY WITH THE AGENT DOES NOT HAVE EXECUTE PERMISSIONS
PI47807 INCORRECT INFORMATION IN DOCUMENTATION ABOUT NSX SUPPORT
PI46160 CLOUD DISCOVERY SERVICE DROPPING
PI47810 Cannot authenticate user to non-default domain from ICO Keystone, while login into Horizon succeeds
PI47813 CANNOT CREATE BLUEPRINT OR CONFIGURATION WITH LDAP ACCOUNT

Fix Pack 8 (6.1.1.8)
Link Date Released Status

02 September 2015

Superseded

APAR Description
PI39169 ISSUES STARTING AGENT RELAY SERVICE ON WINDOWS WITH IBM JVM
PI46039 PROCESS FAILS IF "RUN IF COMPONENTS CHANGE" IS CHECKED
PI45481 UNUSED TAGLIB CAUSES ERROR ON LOGIN
PI44379 APPLICATION PROCESS DESIGN EDITOR DOES NOT PROPERLY DISPLAY COMPONENTS WITH NAMES THAT CONTAIN THE CHARACTERS ']' AND '['
PI45953 UPGRADE OF PLUGIN RENAMES STEPS WITH SAME NAMES
PI47202 DATABASE MIGRATION SCRIPT FAILS
PI46706 INCONSISTENT RESULTS DURING COMPONENT VERSION DOWNLOADS
PI46557 PERFORMANCE DELAYS DISPLAYING CONFIGURATION TAB TREE
PI43268 INCORRECT SORTING OF ENVIRONMENT PROPERTIES LIST
PI45937 ERROR WHEN RUNNING UCD INSTALLATION SCRIPT
PI44605 INCORRECT FILTER FUNCTIONALITY WHEN SELECTING TEAMS IN UI
PI46451 HIGH CPU ASSOCIATED WITH BACKGROUND RESOURCE SYNC SERVICE
PI44952 COMPONENT AND RESOURCE PROPERTIES NOT RESOLVING IN COMPONENT PROCESS PROPERTY DEFINITIONS
PI46644 A MISSING COMPONENT PROCESS SELECTION IN A RUN COMPONENT PROCESS STEP PREVENTS DEPLOYMENTS
PI36759 UDCLIENT INSTALLED AUTOMATICALLY WITH THE AGENT DOES NOT HAVE EXECUTE PERMISSIONS

Mod Pack 2 (6.1.2)
Link Date Released Status

31 July 2015

Superseded

APAR Description
PI32845 SELECTING MULTIPLE APPLICATIONS IN REPORTS NOT SHOWING CORRECT RESULTS
PI35624 SYNCHRONIZING SECURE RESOURCE PROPERTIES EXPOSES THEM
PI39297 THE REQUIRED ROLE FIELD ON APPLICATION PROCESSES DOES NOT TAKE TEAM MAPPING INTO ACCOUNT
PI41656 UNABLE TO USE COMPONENT VERSION COMPARE WITH CHINESE CHARACTERS
PI42269 FAILURES FOR CHECK IF RESOURCE EXISTS COMMAND DUE TO SPECIAL CHARACTERS SPECIAL CHARACTERS
PI42945 CANNOT UPGRADE SERVER IF ENCRYPTION.KEYSTORE.PASSWORD DOES NOT MATCH SERVER.KEYSTORE.PASSWORD
PI43012 AGENT DOES NOT SHUT DOWN GRACEFULLY IF AGENT CANNOT RESOLVE HOSTNAMES
PI44003 COMPONENT VERSION UPLOADS FAIL WITH 400 BAD REQUEST FOR PATHS WITH NON-ENGLISH CHARACTERS
PI44044 INCORRECT PRIVILEGES REQUIRED FOR DEPLOY AND ROLLBACK DATA SETS
PI44544 INCORRECT HANDLING OF DELETED LDAP USER
PI44814 NO PAGINATION IN GROUPS TABLE ON TEAMS PAGE
PI45725 SOME OBJECTS NOT COMPLETELY DELETED

Interim Fix 1 (6.1.1.7_iFix001)
Link Date Released Status

14 August 2015

Superseded

APAR Description
-- This interim fix includes updates to the Java technology that is bundled with the IBM UrbanCode Deploy release on Passport Advantage. Use this interim fix to stay current with the most recent versions of Java.

Fix Pack 7 (6.1.1.7)
Link Date Released Status

29 July 2015

Superseded

APAR Description
PI32845 SELECTING MULTIPLE APPLICATIONS IN REPORTS NOT SHOWING CORRECT RESULTS
PI35624 SYNCHRONIZING SECURE RESOURCE PROPERTIES EXPOSES THEM
PI39297 THE REQUIRED ROLE FIELD ON APPLICATION PROCESSES DOES NOT TAKE TEAM MAPPING INTO ACCOUNT
PI41656 UNABLE TO USE COMPONENT VERSION COMPARE WITH CHINESE CHARACTERS
PI42269 FAILURES FOR CHECK IF RESOURCE EXISTS COMMAND DUE TO SPECIAL CHARACTERS SPECIAL CHARACTERS
PI42945 CANNOT UPGRADE SERVER IF ENCRYPTION.KEYSTORE.PASSWORD DOES NOT MATCH SERVER.KEYSTORE.PASSWORD
PI43012 AGENT DOES NOT SHUT DOWN GRACEFULLY IF AGENT CANNOT RESOLVE HOSTNAMES
PI44003 COMPONENT VERSION UPLOADS FAIL WITH 400 BAD REQUEST FOR PATHS WITH NON-ENGLISH CHARACTERS
PI44044 INCORRECT PRIVILEGES REQUIRED FOR DEPLOY AND ROLLBACK DATA SETS
PI44544 INCORRECT HANDLING OF DELETED LDAP USER
PI44814 NO PAGINATION IN GROUPS TABLE ON TEAMS PAGE
PI45725 SOME OBJECTS NOT COMPLETELY DELETED

Fix Pack 6 (6.1.1.6)
Link Date Released Status

29 June 2015

Superseded

APAR Description
-- This release contains a fix for a security vulnerability. Review Security Bulletin: Vulnerability in DHE key exchange algorithm affects IBM UrbanCode Deploy (CVE-2015-4000) for more details.
PI28826 INSTALL MULTIPLE COMPONENTS FAILING RANDOMLY
PI37669 UNCLEAR DISPLAY FOR SHOWING DEFAULT LOCALE
PI38305 TAG FILTER NOT DISPLAYING ON AGENTS TAB
PI38646 UNABLE TO VIEW INACTIVE COMPONENTS AFTER UPGRADE
PI39671 CANNOT VIEW COMPONENT PROPERTIES IN SNAPSHOT CONFIGURATION WHEN SNAPSHOT INCLUDES PROPERTIES FOR DELETED COMPONENTS
PI39852 CANNOT CREATE APPROVAL PROCESS AFTER UPGRADE
PI39997 COMPLIANCY INCORRECT WHEN DEPLOYING MULTIPLE NON-INCREMENTAL VERSIONS ON THE SAME DEPLOYMENT
PI40092 REMOVE INVENTORY STATUS STEP SHOWS STRING RATHER THAN ACTUAL NAME
PI40282 DUPLICATE ENTRIES ON CALENDAR FOR DEPLOYMENTS AFTER 10:30PM
PI41235 DELAYS LOADING DETAILS FOR ALL COMPONENT TEMPLATES
PI41856 FILES IN VAR/SA/DIALOGUE DIRECTORY ARE NOT DELETED WHEN THE REQUEST TIMES OUT
PI41967 UNABLE TO CANCEL AUTOMATIC VERSION IMPORT
PI42248 PERFORMANCE DELAYS WHEN LOADING A PLUGIN WITH COMPONENT TEMPLATES
PI42406 AGENT RELAY CANNOT FIND A VALID SSL CIPHER SUITE
PI42940 PERFORMANCE DELAYS DURING BATCH COPY, MOVE, CREATE AND DELETE OPERATIONS FOR LARGE DATA SETS
PI43323 ISSUES WITH SCHEDULING RECURRING REPORT ON CALENDAR PAGE
PI43189 ISSUES WITH z/OS TOOLKIT ACCESS TO UCD.SLPP.JAR
PI43188 ROLLBACK FAILS FOR NEWLY DEPLOYED MODULES
PI40581 IMPERSONATION CREDENTIALS NOT RESOLVED PROPERLY

Fix Pack 5 (6.1.1.5)
Link Date Released Status

29 May 2015

Superseded

APAR Description
PI43816 ERROR OBSCURING COMPONENT TEMPLATES TAB
PI37209 LIST OF COMPONENTS IN APPLICATION DOES NOT INDICATE IF VERSION IMPORT FAILED ON THE COMPONENTS
PI37456 ISSUES CONNECTING AGENTS USING IP WHEN "VALIDATE AGENT IP" IS TURNED ON
PI37680 ISSUES EDITING A GENERIC PROCESS WITHIN A 'FOR EACH AGENT...' ITERATION
PI37717 ISSUES WITH SUBRESOURCES IN TWO DIFFERENT RESOURCE GROUPS DURING UPGRADE
PI37881 PERFORMANCE ISSUES WITH PROCESSES CONTAINING STEPS NOT REQUIRING EXECUTION
PI37992 PERFORMANCE ISSUES WITH LOADING CHILD NODES IN RESOURCE TREE UNDER SETTINGS -> TEAMS -> RESOURCES
PI38999 USERS CANNOT EDIT RECURSIVE PROCESSES
PI39167 USER CAN INCORRECTLY CREATE RESOURCE FROM CLI WITH DELETED COMPONENT AS ROLE
PI39175 AGENT DOES NOT ENCRYPT KEYSTORE PASSWORD PROPERTY
PI39437 UNABLE TO SAVE APPLICATION PROCESS DUE TO OPERATIONAL PROCESSES
PI39479 PERFORMANCE DELAYS DURING UPGRADE 26 IN UPGRADE_SQL_5.0.XML
PI39752 ISSUES LOADING VERSION SELECTION TABLE WHEN SELECTING VERSIONS FOR A DEPLOYMENT
PI39758 VERSION PRESETS NOT EXPORTED WITH APPLICATION
PI40087 ISSUES WITH DEPLOYING DUE TO HANGING PLUGIN STEP
PI40259 ISSUES STARTING AGENT RELAY WHEN SERVER NOT CONFIGURED DURING INSTALLATION
PI40454 INCORRECT STATUS WHEN ADDING A COMPONENT
PI40545 SETTING ROLE PROPERTY WITH INCORRECT NAME THROWS NULLPOINTEREXCEPTION
PI41072 ERROR IMPORTING GENERIC PROCESS WITH HTTP PROPERTY
PI41291 CANCELLING RECURRING SCHEDULED PROCESSES NOT ENABLED

Fix Pack 4 (6.1.1.4)
Link Date Released Status

24 April 2015

Superseded

APAR Description
PI38332 SORT ORDER OF THE EXECUTION LOG IS NOT PRESERVED
PI37468 MANUAL TASK SECURE PROPERTY VALUE IS NOT OBFUSCATED
PI36404 INCORRECT USAGE OF SOURCE CONFIG ON COMPONENTS WHEN USING A TEMPLATE
PI27825 BATCH EDIT MODE REQUIRES CERTAIN ESCAPE CHARACTERS
PI29997 WORKING DIRECTORY AT TOP OF LOGS DO NOT OBFUSCATE SECURE PROPERTY VALUES
PI30004 IMPERSONATION SET ON RESOURCE NOT APPLYING DURING WAS AUTO-DETECTION
PI30440 VERSION IMPORT ERROR NOTIFICATIONS CANNOT BE CLOSED
PI38340 ISSUES RUNNING PROCESSES FOR AGENTS INSTALLED TO A PATH CONTAINING SPACES
PI38119 INCORRECT HTTP RETURN VALUES FOR CLI CALLS RESULTING IN CONCURRENTMODIFICATIONEXCEPTIONS
PI38343 ERROR IN LOG WHEN SAVING APPLICATION PROCESS CONTAINING DELETED GENERIC PROCESS
PI32811 PERFORMANCE ISSUES WITH DEPLOYMENT DASHBOARD WITH MULTILE PROCESSES
PI38366 VERSION PROPERTY REFERENCES CAN RESOLVE TO PROPERTIES OF OLDER VERSIONS
PI38372 PERFORMANCE ISSUES WITH DISPLAYING THE RESOURCE TREE
PI35025 PERFORMANCE ISSUES WITH CREATING ENVIRONMENTS FROM BLUEPRINTS WITH LARGE NUMBERS OF RESOURCES
PI35045 "MANAGE PROPERTIES" PERMISSIONS ON COMPONENTS INCORRECTLY REQUIRED TO EDIT COMPONENT ENVIRONMENT PROPERTIES
PI35115 APPLICATION TAGS ARE NOT CONTAINED IN IMPORT OR EXPORT
PI35484 EMPTY ALERT WHEN TRYING TO MOVE MULTIPLE RESOURCES IN THE RESOURCE TREE
PI35686 COPIED COMPONENTS INCORRECTLY CALL WRONG PROCESS WITH RUN COMPONENT PROCESS STEPS
PI35701 WHEN DRAGGING COMPONENTS FROM SIDE BAR INTO RESOURCE TREE YOU SEE DUPLICATE ENTRIES UNTIL REFRESH
PI35713 DELETING ENVIRONMENT WHILE APPROVALS IN PROCESS MAKES THE APPLICATION HISTORY SHOW THE PROCESS AS WAITING FOR APPROVAL
PI35968 PROCESS STARTED NOTIFICATIONS CONTAIN MISLEADING INFORMATION
PI36224 FAILURE TO IMPORT APPLICATION WITH UPGRADE CHECKED WITH APPLICATION ALREADY EXISTS ERROR
PI36260 THE NOTIFICATION TEMPLATE FIELD FOR APPROVAL TASKS IS NOT SAVED
PI36529 CANCELING A PROCESS REMOVES THE LINKS TO VIEW THE OUTPUT LOGS FROM STEPS WITHIN THE PROCESS
PI36701 ALL USERS WITH ACCESS TO CALENDAR CAN RESCHEDULE OR DELETE SCHEDULED PROCESSES
PI37881 PERFORMANCE ISSUES WITH PROCESSES CONTAINING STEPS NOT REQUIRING EXECUTION
PI37885 AGENT STATUS DOES NOT REFLECT ACTUAL AGENT CONNECTIVITY
PI37915 ATTEMPTS TO SAVE ENVIRONMENT CONNECTED TO IPAS 1.X FAIL
PI38493 UNABLE TO SELECT APPLICATION PROCESS WITH MORE THAN 25 PROCESSES IN DROPDOWN
PI39176 ISSUES WITH UCD MIGRATION DUE TO ADDITION OF AGENT TOPOLOGY TABLES
PI39707 ERRORS PROVISIONING ENVIRONMENT FROM BLUEPRINT
PI30256 INSUFFICIENT INFORMATION FOR TEAMCITY SOURCECONFIG PLUGIN ONLINE HELP
PI25306 UNABLE TO DELETE UNUSED TAXONOMY FROM MANAGE TAXONOMIES IN XET

Fix Pack 3 (6.1.1.3)
Link Date Released Status

26 March 2015

Superseded

APAR Description
This release contains a fix for a security vulnerability. Review Security Bulletin: Vulnerability in Apache Tomcat (CVE-2014-0227) for more details.
PI23984 Groovy Adding '.' to the classpath can result in ClassNotFoundException
PI26045 SNAPSHOT VERSION ORDER ON IMPORT IS INCORRECT
PI26337 TOKENS NEVER RELEASED BY UCD SERVER
PI27401 INCONSISTENT HELP IN AGENT.CMD
PI27605 SLOW PERFORMANCE WHEN DELETING ROLES
PI27837 CREATEAPPLICATIONPROCESS DOES NOT SUPPORT PROCESS PROPERTYDEFINITIONS
PI28902 ESCAPE CHARACTERS IN PROPERTY SHEET CAUSE LOADING ERROR
PI30623 EOFEXCEPTION ERRORS IN SERVER LOGS
PI32741 ISSUES WITH AGENT CONNECTION TEST IN MULTI-SERVER ENVIRONMENTS
PI33326 PLUG-INS AND CLIENT INTERMITTENTLY FAIL SILENTLY WITH CONCURRENTMODIFICATIONEXCEPTION IN LOG
PI33772 CHANGES TO THE MAIL SERVER SETTINGS DO NOT TAKE EFFECT UNTIL THE SERVER IS RESTARTED
PI33802 CONFUSION SURROUNDING DELETED PROCESSES RUNNING OUTSIDE OF SNAPSHOTS
PI33878 AGENT RELAY VERSION NUMBER NOT SPECIFIED
PI34220 LIMITED CONTENT IN EXCEPTION MESSAGES FROM LDAP AUTHENTICATION REALMS
PI34542 PLUGINS INCORRECTLY HANDLES FORWARD SLASH 'C:/' IN ALTERNATE AGENT WORKING DIRECTORY
PI35013 UNABLE TO IMPORT APPLICATIONS THAT USE ADVANCED INVENTORY MANAGEMENT
PI35305 ISSUES WITH VERSION IMPORT TOKENS NOT BEING DELETED
PI35492 UDCLIENT: FAILS TO CREATE AUTHTOKEN WITH CORRECT EXPIRATION TIMES
PI35618 AUTO IMPORT FAILS AFTER UPGRADE TO 6.1.1.2 USING AN ORACLE DATABASE
PI35623 UPGRADE TO 6.1.0.4 IS SLOW
PI35665 TAGS REMOVED FROM COMPONENT AFTER INSTALLING COMPONENT BY TAG
PI35964 INSTALL AGENT THROUGH SSH DOES NOT ADD TEAMS
PI35986 OUTPUT LOGS MAY FAIL TO SHOW FOR RUNNING STEPS
PI36082 UPGRADING FROM 6.1.1.0 TO 6.1.1.2 FAILS STEP 8 ON ORACLE
PI36173 SYMLINKS ARE NOT BEING HANDLED CORRECTLY DURING INSTALLATION
PI36218 CANNOT CREATE ENVIRONMENT IF RESOURCE TEMPLATE WAS DELETED
PI36526 ISSUES WITH SECURITY ROLES CAUSING ERRORS CREATING OBJECTS
PI36756 ERROR: NO SUCH PROPERTY: VALUE WHEN MIGRATING FROM DERBY TO DB2
PI36827 GIT SOURCE CONFIG PLUGIN DOES NOT USE AGENT VAR/TEMP DIR FOR CLONED REPOSITORIES
PI37088 CANNOT EDIT OR RUN APPLICATION OR COMPONENT PROCESSES AFTER 6.1.1.2 UPGRADE
PI35873 ARCHIVED VERSIONS CAN BE ADDED TO SNAPSHOTS
PI36677 ERROR USING TAGS TO ACCESS AGENT FOR VERSION IMPORT
PI35969 DRAG AND DROPPING A TOP LEVEL RESOURCE RESULTS APPEARS TO COPY
PI35507 AGENTS CAN ENCOUNTER SSL CONNECTION ERROR WHEN DOWNLOADING PLUGIN FILES DURING HIGH SERVER LOAD
PI35529 ISSUES WITH STARTING SERVERS PERFORMANCE DURING "WORKFLOW ENGINE STARTED" STEP
PI36070 PROCESS MARKED AS "FAILED" EVEN THOUGH ALL STEPS MARKED AS "SUCCEEDED" IN HA
PI36432 INACTIVE SNAPSHOTS NOT HIDDEN FROM UI

Fix Pack 2 (6.1.1.2)
Link Date Released Status

20 February 2015

Superseded

APAR Description
PI26069 COMPONENT TEMPLATES ALWAYS SHOW PROPERTIES FOR THE LATEST COMPONENT TEMPLATE VERSION
PI31639 APPLICATION PROCESS PROPERTIES CANNOT BE SET THROUGH THE CLI, REST, OR CREATE APPLICATION PROCESS STEP
PI31641 ENVIRONMENT INVENTORY SHOWS SNAPSHOT DEPLOYED REGARDLESS OF NON-SNAPSHOT DEPLOYMENTS
PI31992 ERROR OCCURS IMPORTING USING AUTOMATIC VERSION CLEANUP
PI32175 COPIED STEPS WITH INVALID REFERENCES NOT ABLE TO LOAD INTO STEP PALETTE IN PROCESS EDITORS
PI32854 INTERMITTENT FAILURES DURING APPROVAL PROCESS IN HIGH-AVAILABILITY ENVIRONMENT
PI33747 AGENT RELAY JAVA KEYSTORE PASSWORD FAILS TO WORK AFTER CHANGING FROM DEFAULT
PI33915 AUTH TOKEN CLEANUP FAILS WITH “SQLEXCEPTION: LOCK WAIT TIMEOUT EXCEEDED; TRY RESTARTING TRANSACTION”
PI34268 INCORRECT PATH FOR TFS_SCM EXECUTABLE
PI34410 MISSING NOTIFICATION EMAILS WHEN PROCESS CONTAINS STEPS THAT ARE NOT EXECUTED (NPE IN LOGS)
PI34464 SSL FOR AGENT RELAY CODESTATION SERVICE DOES NOT DETECT INVALID CERTIFICATE NAMES
PI34532 APPLICATION SNAPSHOT CONFIGURATION ONLY ALLOWS ONE COMPONENT VERSION TO BE ADDED AT A TIME
PI34537 UNABLE TO CANCEL AUTOMATIC VERSION IMPORT PROCESSES
PI35417 CREATEAPPLICATIONPROCESS CLI COMMAND RESULTS IN NULL POINTER

Fix Pack 1 (6.1.1.1)
Link Date Released Status

2 February 2015

Superseded

APAR Description
PI30836 ISSUES WITH AGENT INSTALLER DISPLAY OF SERVICE LOGIN
PI28241 ORACLE 1000 ERRORS
PI30258 MYSQL BROKEN PIPE CAUSES CALENDAR SERVICE TO STOP
PI31010 MISSING DESCRIPTION OF PATHOVERRIDE, PROFILEPATHAGENT, PROFILEPATHRESOURCE IN PLUGIN.XML
PI33072 WEBSPHERE DISCOVERY FAILING ON RESOURCES THAT DON'T HAVE WEBSPHERE INSTALLED
PI31744 WHEN USING RUN PROCESS AFTER VERSION IMPORT FEATURE ALL LATEST VERSION FOR ALL COMPONENTS ARE DEPLOYED.
PI31318 CANNOT RESTORE VERSION FROM ARCHIVE IF NO SOURCE CONFIG SET
PI32651 THE SERVICE SCRIPT FOR THE UCD SERVER DOESN'T PROTECT AGAINST A PREFIX BEING ADDED TO THE SERVICE NAME IN RHEL
PI30298 WORKFLOW REPORT DATA IS NOT DISPLAYED AFTER UPGRADE
PI31149 NULLPOINTEREXCEPTION OCCURS IN UPGRADE 7 OF UPGRADE_SQL_5.0.XML
PI32898 SERVER UPGRADE FAILS FOR SQL SERVER DATABASES
PI31412 UPDATE PROPERTY FILE STEP DOES NOT PARSE COLONS CORRECTLY
PI31738 WINRS CREDENTIALS PROVIDED ARE NOT USED IN WINRS AGENT INSTALL
PI32601 CANNOT CREATE GROUP LDAP AUTHORIZATION REALM WITH CLI
PI31720 AGENTCLI/TEST INCORRECTLY RETURNS CONTENT TYPE
PI31578 DOCUMENTATION FOR REST ENDPOINT TO UPLOAD FILES TO A VERSION IS DEPRECATED
PI31431 REPLACE_TOKENS.PROPERTIES FILE LEFT BEHIND IF REPLACE TOKENS STEP FAILS
PI32390 VFS PLUGIN - SYNC STEP FAILS WITH ERROR IF RESOURCE HAS NO INVENTORY
PI29691 AN ERROR HAS OCCURRED MESSAGE APPEARS WHEN ATTEMPTING TO VIEW APPLICATION HISTORY TABLE
PI31333 COMPONENT VERSION AUTOMATIC IMPORT PROCESSES HANG IN 'WAITING' STATE
PI26672 COMPONENT TEMPLATE TAGS NOT PROPERLY PROCESSED
PI31238 COMPLETED BY IS NOT DISPLAYED IF THE APPROVAL DOES NOT HAVE A COMMENT
PI29353 AN ERROR HAS OCCURRED APPEARS IN PLACE OF THE WORK ITEMS TABLE WHEN AN ENVIRONMENT WITH A TASK THAT NEEDS APPROVAL IS DELETED
PI31434 CREATION OF APPLICATION IN DEPLOY USING API DOES NOT RETAIN OFFLINE AGENT POLICY
PI30832 WINRS SERVICE PASSWORD NOT CORRECTLY PASSED TO PLUGIN STEP
PI22193 SETTING VERY HIGH VALUES FOR AUTOIMPORT OF VERSIONS CAUSES SERVER TO NOT START
PI32810 CLEANUP NOT HAPPENING IN VAR/SA/DIALOGUE FOLDER ON SERVER
PI30250 UNABLE TO SORT AND FILTER THE NAME COLUMN ON THE WORK ITEMS PAGE TABLE
PI30948 NOTIFICATION EMAILS DISPLAY "NO INVENTORY CHANGES MADE" WHEN VERSIONS ARE DEPLOYED
PI20733 A COMPONENT VERSION PROPERTY TAKE PRECEDENCE OVER A PROCESS PROPERTY
PI30078 INITIAL SAVING OF NEW WINRS AGENT INSTALLATION PROPERTIES CAUSES THE "SERVICE NAME" AND "SERVICE USER" TO BE SWAPPED
PI30606 OFFLINE AGENT DIALOG DOES NOT SHOW AGENT NAME
PI32269 NO DOCUMENTATION FOR COMPONENT TEMPLATE PROPERTIES ON NEW COMPONENTS VIA CLI/REST API

Mod Pack 1 (6.1.1)
Link Date Released Status

11 December 2014

Superseded

APAR Description
PI09093 COMPONENT PROCESS FAILS IF PROPERTY CONTAINS JAPANESE CHARACTERS
PI17468 COMPONENT TEMPLATE EDIT TAB PAGE IS SLOW TO LOAD
PI20093 UNABLE TO DELETE RESOURCE TEMPLATES USING THE CLI
PI20525 CLI DOCUMENTATION SHOULD INCLUDE INSTRUCTIONS FOR MODIFYING .JSONS USED IN CLI COMMANDS
PI21802 CAN'T MAP ENVIRONMENTS TO TEAM WHEN THEY HAVE THE SAME NAME
PI24093 PRECONDITION STATEMENT FAILS TO EVALUATE WHEN USING AN INSTALL MULTIPLE COMPONENTS STEP
PI24525 UPDATES NEEDED FOR "AUTHENTICATING WITH A SESSION KEY" HELP
PI24540 POST-PROCESSING SCRIPT EXAMPLE IS INCORRECT
PI24993 MISSING INFORMATION ABOUT JAVA_HOME
PI25937 AGENT CAN REPEATEDLY SEND JMS MESSAGES TO THE SERVER AFTER A PLUGIN STEP HAS COMPLETED RESULTING IN SACONTAINER ERRORS
PI26259 THE CLEARCASE UCM PLUGIN ALSO WORKS WITH BASE CLEARCASE
PI26814 KNOWLEDGE CENTER REFERS TO ROLE INSTEAD OF TYPE
PI26864 UDCLIENT DOCUMENTATION DOES NOT MENTION PROXY OPTIONS
PI26995 COMPONENT PROCESS PROPERTIES ARE NOT RESOLVED WHEN RUNNING A COMPONENT PROCESS INDEPENDENT OF AN APPLICATION PROESS
PI27377 MEMORY LEAK ERROR ON SERVER SHUTDOWN
PI27472 LASTMODIFIEDTIMESTAMP MISSING WHEN SHIPLIST USES FULL MEMBER NAME
PI27473 VERSION CREATION USING Z/OS URBANCODE TOOLKIT FAILED WHEN USER SPECIFIES THE FULL MEMBER NAME
PI27723 CANNOT USE PROCESS DESIGN PALETTE AFTER DELETING COMPONENT FROM COPIED STEP
PI27727 IMPORT GROUP DOCUMENTATION IS INCONSISTENT
PI27758 GETTING NOT MAPPED WHEN EXECUTING APPLICATION
PI28758 INCORRECT CONTENT TYPE ON 404 WHEN APPLICATION DOES NOT EXIST
PI28799 COMPONENT RESOURCE PROPERTIES NOT EXPORTED OR IMPORTED
PI28833 DELETED USERS CAUSE NPES IN 4.8.4
PI28902 ESCAPE CHARACTERS IN PROPERTY SHEET CAUSE LOADING ERROR
PI28943 REST API DOWNLOADARTIFACTS DOES NOT HANDLE DBCS CHARACTERS CORRECTLY
PI29066 JIRA PLUG-IN: CHECK STATUS STEP FAILS WITH ERROR "ASSERTION FAILED"
PI29094 ORACLE SQL *PLUS PLUG-IN DOES NOT HANDLE WILDCARDS IN FILE NAMES CORRECTLY
PI29513 A USER MAY SEE AN ERROR RELATED TO READ ACCESS TO A COMPONENT OR TEMPLATE WHEN REQUESTING AN APPLICATION PROCESS
PI29648 EMAIL NOTIFICATION FAILS TO SEND WITH NULL POINTER EXCEPTION IN THE LOGS
PI30178 DOCUMENTATION REFERS TO INACTIVE AGENTS
PI28766 IMPORT PROPERTIES STEP DOES NOT WORK
PI30262 DOCUMENTATION INCORRECTLY STATES STORAGE LOCATION FOR AGENT RESOURCE INVENTORY

Fix Pack 4 (6.1.0.4)
Link Date Released Status

31 October 2014

Current

APAR Description
-- Fix for a vulnerability in SSLv3 (referred to as the Padding Oracle On Downgraded Legacy Encryption (POODLE) attack). Review Security Bulletin: Vulnerability in SSLv3 affects IBM UrbanCode Deploy (CVE-2014-3566) for details.
PI05260 OPTION "SYNC" IN "DOWNLOAD ARTIFACTS" STEP DOES NOT DELETE DIRECTORIES IN PREVIOUS VERSION
PI10910 WORKAROUND DIRECTORY IS UNDEFINED WHEN DEPLOY CANNOT RESOLVE AN UNKNOWN VARIABLE
PI11716 DEPLOY SETS DOWNLOAD ARTIFACTS STEP'S STATUS INCORRECTLY.
PI19387 REPORTS NAVIGATION BAR PRODUCES URLS THAT ARE NOT ENCODED
PI22047 NULLPOINTEREXCEPTION WHEN RUNNING SQL PLUS PLUGIN AND SCRIPT IS MISSING
PI23461 WHEN OPENING A PROCESS THAT HAS BEEN RUN A FEW HUNDRED TIMES, TH E "PROCESS REQUESTS" HISTORY PANE WILL TAKE A LONG TIME TO LOAD
PI23525 REPORTS IN UC DEPLOY ONLY SHOW CURRENT DAY'S VALUES
PI24137 CLI AND REST API COMMAND ADDUSERTOTEAM SHOULD TAKE A PARAMETER NAMED ROLE, NOT TYPE
PI24219 ATTEMPT TO SEND COMMAND TO WEBLOGIC USING WEBLOGIC APPLICATION DEPLOYMENT PLUGIN V3 MAY RESULT IN JAVA.LANG.CLASSFORMATERROR
PI24364 DEPLOYMENT DETAIL REPORT STOPS WORKING
PI25537 CLICKING BREADCRUMB LINKS WITH UNSAVED CHANGES IGNORES WARNING
PI25921 SSO DELIMITER PROPERTY IS NOT WORKING AS EXPECTED
PI26232 STARTING A HIGH NUMBER OF GENERIC PROCESSES FROM OTHER WORKFLOWS CONCURRENTLY CAN CREATE A DEADLOCK
PI26380 CLEARCASE SOURCE CONFIG RAISES EXCEPTION VERSION WITH NAME NULL ALREADY EXISTS
PI26480 HOST NAME IS IN USE BUT NEVER SPECIFIED
PI26503 PROPERTY AUTOCOMPLETE SUGGESTS COMPONENT PROCESS PROPERTIES AS ${P:COMPONENTPROCESS/PROPERTY} INSTEAD OF ${P:PROPERTY}
PI26547 Z/OS VERSION ARTIFACTS HAVE INCORRECT TIMESTAMP
PI26580 COMPONENT TEMPLATE COLUMN NOT POPULATED
PI26644 THE RECOMMENDED VERSION FOR AGENTS IS NOT THE SAME AS THE AGENT VERSION INCLUDED WITH THE SERVER
PI26683 USERS ARE UNABLE TO ADD TWO ENVIRONMENTS ON DIFFERENT APPLICATIONS WITH THE SAME NAME TO THE SAME TEAM
PI26736 DATE FIELDS DEFAULT TO TWO-DIGIT YEARS, POTENTIALLY BREAKING INPUT OF YEARS LATER THAN 2040
PI26738 ADDING A "FOR EACH AFFECTED RESOURCE" STEP SHOWS AS "FOR EACH TOUCHED RESOURCE" IN THE WORKFLOW GRAPH
PI26823 USERS CAN CREATE MULTIPLE STEPS WITH THE SAME NAME IN AN APPLICATION PROCESS
PI26829 LABEL IS NOT SET WHEN CREATING A VERSION PROPERTY DEFINITION USING THE CLI
PI26934 DELETING ENVIRONMENTS FROM THE SAME APPLICATION SIMULTANEOUSLY CAN FAIL
PI26946 THE MAIL SERVER SETTING IS NOT REFLECTED UNTIL SERVER RESTART
PI26952 SELECTING A COMPONENT IN A LONG LIST OF COMPONENTS FOR THE COMPONENT ENVIRONMENT PROPERTY FILTER NOT FUNCTIONING
PI27001 APPLICATION PROCESS REQUESTS THAT FAIL TO START ARE MARKED AS PENDING IN THE CLIENT
PI27172 CREATING RESOURCES CAN TAKE A LONG TIME IF RESOURCESYNCSERVICE IS RUNNING
PI27343 APPLICATIONREQUESTID COLUMN MISSING FROM DEPLOYMENT DETAIL REPORT
PI27506 DIALOG TO IMPORT USER SAYS 'SAVE' INSTEAD OF 'IMPORT'
PI27734 ERRORS USING THE UPDATE JDBC DATA SOURCE STEP IN THE WLS RESOURCE MANAGEMENT PLUGIN WITH UCD
PI26261 THE FIELD VOB LOCATION HAS INCORRECT NAME IN THE CLEARCASE

Fix Pack 3 (6.1.0.3)
Link Date Released Status

19 September 2014

Superseded

APAR Description
PI22706 EDITING ENVIRONMENT/COMPONENT MAPPING PROPERTIES FOR A COMPONENT IS INEFFICIENT
PI22720 RESOURCE TEMPLATE GETS UPDATED WHEN CHANGING BLUEPRINT
PI22779 THE USER INTERFACE AND THE HELP USE THE TERMS ROLE AND TYPE IN AN INCONSISTENT WAY
PI23287 WHEN UCD SERVER USES ORACLE DB, IT SORTS APPLICATIONS BY CASE.
PI23811 USER MISCONFIGURATION RELATED ERROR MESSAGES ARE NOT DISPLAYED IN THE LOGS
PI23853 UNABLE TO CREATE RESOURCE
PI23945 ERROR WHEN CREATING AN ENVIRONMENT FROM A BLUEPRINT WITH AN AGENT PROTOTYPE REFERENCING AN EXISTING AGENT
PI23996 LOADING ENVIRONMENTS IN THE OBJECT SECURITY MAPPING PAGE CAN CAUSE ORACLE ERROR
PI24030 ATTEMPT TO RUN APPLICATION PROCESS AGAINST A TAG WITH DEBUG LOGG ING RESULT IN THROWING JAVA.UTIL.CONCURRENTMODIFICATIONEXCEPTION
PI24230 DOCUMENTATION INCORRECTLY SPECIFIES IMPORTLDAPUSER NEEDS THE INPUT IN JSON FORM
PI24546 USERS ARE INCORRECTLY ALLOWED TO CREATE A CHILD RESOURCE OF A PARENT RESOURCE WHICH HAS BEEN DELETED
PI24740 CANNOT CREATE ENVIRONMENTS AFTER SELECTING BLUEPRINT AND REMOVING
PI24742 PROCESSES WITH FLOATING STEPS HAVE THEIR EXECUTION RUN FOREVER
PI24866 DEPLOYING CURRENT ENVIRONMENT INVENTORY REVERSES VERSIONS
PI24872 THE DEPLOY PROCESS TABLE AUTOMATICALLY SCROLLS TO THE TOP
PI25064 CANNOT COMPLETE A MANUAL TASK ON A COMPONENT OR APPLICATION
PI25065 LDAP GROUPS DO NOT SYNC WITH UDEPLOY
PI25073 NO ERROR SHOWN TO USER WHEN TRYING TO PASTE A COMPONENT PROCESS WITH A RUN COMPONENT PROCESS STEP.
PI25123 AGENTS REMOVED RETURN WITH ID AND NO INFORMATION OR PROPERTIES
PI25137 SOME CHARACTERS IN FOLDER NAMES CAUSE ERRORS WHEN VIEWING VERSION ARTIFACTS FROM UI
PI25213 SUBMITTING THE "RUN APPLICATION PROCESS" DIALOG CAN FAIL WITH "ENVIRONMENTID" ERROR IF USER CLICKS IT QUICKLY
PI25348 IMPERSONATION SOMETIMES FAILS TO WORK IN WINDOWS SERVER 2012
PI25575 AGENTS NO LONGER COME ONLINE AFTER SOME TIME RUNNING THE SERVER WITH HEAVY AGENT USAGE
PI25679 LIST OF SECURITY ROLES IS NOT IN ALPHABETICAL ORDER
PI25764 COMPONENT PROCESS PROPERTY NOT DISPLAYED IN PROCESS DESIGN
PI25842 SNAPSHOT FILE COMPARISON FAILS WITH JAVASCRIPT ERROR
PI25889 CANNOT DOWNLOAD ARTIFACTS USING OLD SNAPSHOTS LOCKED PRIOR TO UPGRADING TO 6.1
PI26029 RUNNING A COMPONENT PROCESS DIRECTLY WHEN DEFINED ON COMPO NENT USING TEMPLATE INCORRECTLY USES OLDER VERSIONS OF PROCESS
PI26040 USER MUST BELONG TO ALL ROLES CONFIGURED ON A MANUAL TASK IN ORDER TO RESPOND TO IT

Interim Fix 1 (6.1.0.2_iFix001)
Link Date Released Status

02 September 2014

Superseded

APAR Description
-- Security release to resolve vulnerabilities in Apache Tomcat. Review Security Bulletin: Apache Tomcat Vulnerabilities in IBM UrbanCode Deploy (CVE-2014-0075,CVE-2014-0095,CVE-2014-0096,CVE-2014-0099,CVE-2014-0119) for details.

Fix Pack 2 (6.1.0.2)
Link Date Released Status

22 August 2014

Superseded

APAR Description
PI12564 DEPLOY CREATES ADDITIONAL RCL_API_LOG_SAMPLE_X_X_XXXX_X.XML IN ITS BIN AT STARTUP
PI19791 NULLPOINTEREXCEPTIONS SHOWN IN LOG WHEN VIEWING REQUESTS WITHOUT PERMISSIONS
PI21105 ERROR AQUIRING LOCK
PI21177 AFTER UPGRADE TO 6.1 FROM 6.0, YOU SEE A "500 INTERNAL SERVER ERROR JAVA.IO.IOEXCEPTION: UNACCEPTABLE RESPONSE: POST" ERROR
PI21243 OUTPUT OF STEP ONLY SHOWN ONCE THE STEP IS COMPLETED
PI21304 DOCUMENTATION SHOULD MENTION THAT AGENTS SHOULD BE ACTIVE BEFORE UPGRADING
PI21520 UNABLE TO PERFORM A PROPER SYNC OPERATION
PI21591 UNZIP PLUGIN IN UCD 6.1.0.1 DOES NOT SUPPORT DBCS
PI21979 UPGRADE FROM 4.8.1 TO 5.0.0.2 FAILS
PI22025 FULL VERIFICATION OPTION IN IBM URBANCODE DEPLOY VERSIONED FILE STORAGE PLUGIN DOESN'T WORK AS EXPECTED
PI22078 INCORRECTLY DELETED ENVIRONMENTS CAUSES UI ERROR IN APPLICATION CHANGES
PI22120 SWITCH STATEMENT FAILS IF OUTGOING EDGES HAVE PROPERTIES AS VALUES
PI22138 APPLICATION UI UNUSABLE WHILE LOADING ENVIRONMENTAL COMPLIANCY
PI22166 FAILED VERSION IMPORT AFFECTS VERSION CLEANUP
PI22184 CAN'T COPY COMPONENTS AFTER UPGRADE TO 6.0.1.5
PI22226 UPGRADE FAILS WITH STRINGINDEXOUTOFBOUNDS WHEN LOADING SECURITY SCHEMA
PI22271 MDHA SSL CONFIGURATION IS MISSING
PI22362 OUTPUT LOG NOT GETTING POPULATED TILL AFTER THE PROCESS IS FINISHED
PI22470 THERE NEEDS TO BE AN OPTION TO DISABLE HTTPFAILOVERHANDLING
PI22529 DEPLOY FAILS TO ACQUIRE LOCK
PI22559 DESCRIPTION OF RESOURCE TEMPLATE AND BLUEPRINT NOT VISIBLE
PI22600 ./AGENT STOP : JDK COULD NOT BE FOUND. NOT PRODUCING THREAD DUMP AND HEAP DUMP. ON AGENT STOP
PI22612 APPLICATION PROCESSES CAN TAKE A LONG TIME TO CONTINUE AFTER THE COMPONENT PROCESS FINISHES
PI22618 THREAD SAFETY ISSUE WHEN PERFORMING RESOLVE ARTIFACT PROCESS STEP.
PI22649 COMPONENT MAPPINGS TO AGENT POOLS INSIDE RESOURCE GROUPS ARE NOT MIGRATED
PI22776 ERROR MESSAGE INVALID OPTION WHEN STARTING THE AGENT SERVICE TWICE
PI22809 WHEN USING THE HEAD METHOD WITH THE WEB UTILS PLUGIN, TEST STEP FAILS
PI22849 AGENTS NOT STARTING ON SOLARIS 5.10 GETTING ERROR " ./AGENT: SYNTAX ERROR AT LINE 131: `WORKER_PROC_ID=$' UNEXPECTED"
PI22900 IMPORTING USERS FROM LDAP USING WILDCARD FAILS
PI22937 [UPGRADE] APPLYING 4.8 CHANGE: 37 - REMOVE OLD TRACE TABLES
PI22979 EVEN IF "ARCHIVE PATH" IS EMPTY, VERSIONS ARE ARCHIVED IN THE BIN FOLDER
PI22981 ERROR MESSAGE "JDK COULD NOT BE FOUND" WHEN STOPPING AGENT SERVICE
PI22987 AGENTHOME/BIN/INIT/AGENT INCORRECTLY REFERS FOR SCRIPT TO IBM-UCDAGENT AND NOT AGENT
PI23254 OPERATIONAL PROCESSES SHOW SUCCESS WHEN NO AGENTS ARE ONLINE
PI23514 LOADING THE RESOURCE TREE TAKES 10 SECONDS OR LONGER FOR A COMPLEX TREE STRUCTURE
PI23607 WHEN USING A CUSTOM KEYSTORE AND ATTEMPTING TO UPGRADE AN AGENT, YOU GET "UNABLE TO CREATE KEYSTORE" ERROR
PI23618 UNABLE TO CREATE A VERSION USING THE CLI
PI23619 APPROVAL CREATED STEP FAILS TO SEND A NOTIFICATION WHEN CREATED.
PI24033 UNABLE TO REMOVE TEAM FROM A GENERIC PROCESS
PI24095 USER DEFINED AGENT PROPERTIES DISAPPEAR (NOT STORED) IN THE LATEST VERSION OF AGENT PROPERTIES AFTER RESTARTING THE AGENT
PI24173 "NO ROW WITH THE GIVEN IDENTIFIER EXISTS: [COM.URBANCODE.SECURITY.SECURITYUSER#22....]
PI24474 LOADING GENERIC PROCESS HISTORY CAN TAKE EXCESSIVELY LONG OR CAUSE OUT-OF-MEMORY ERRORS
PI17679 RUN PROCESS DIALOG ONLY SHOWS "LOADING..." FOR PROCESS SELECTION
PI18568 SNAPSHOT ADVANCED SETTINGS REFRESH TAKES LONGER THAN A COUPLE MINUTES
PI18869 LOOPS WITHIN COMPONENT PROCESS LEAD TO SERVER HANGS
PI19093 SYNTAXERROR WHEN EXECUTING A JACL SCRIPT VIA EXECUTE WSADMIN SCRIPT STEP
PI19454 AGENT GETS NULLPOINTEREXCEPTION WHEN RESTARTED AFTER REBOOT STEP
PI19548 THE IMPORTVERSIONS TEMPLATE IS NOT CLEAR ON REQUIRED PARAMETERS
PI19611 THE WORK ITEMS SECTION OF UDEPLOY IS NOT VISIBLE.
PI20186 URBANCODE DEPLOY LEAKS MEMORY WHEN CREATING AND DELETING ENVIRONMENTS IN SMART CLOUD ORCHESTRATOR
PI20323 UNABLE TO VIEW WORK ITEMS TAB
PI20412 UNABLE TO REMOVE A CUSTOM AUTHORIZATION REALM
PI20664 ATTEMPTS TO CALL A COMPONENT PROCESS FROM ANOTHER COMPONENT PROCESS FAIL
PI20891 AUTOMATIC CLEANUPS ARE FAILING
PI21096 CANNOT RENAME RESOURCE'S TOP-LEVEL GROUP: ILLEGAL CHARACTER RANGE NEAR INDEX 8
PI21172 ARTIFACT UPGRADE STATUS BAR DOES NOT SHOW 100% EVEN THOUGH ARTIFACT MIGRATION COMPLETED.
PI21274 UNABLE TO UPLOAD LOGS TO SERVER AT ...... : JAVA.LANG.ILLEGALARGUMENTEXCEPTION
PI21794 AGENT ONLINE EVENTS CAN CAUSE A TRANSACTION TO BE LEFT OPEN
PI23002 URBANCODE DEPLOY PENDING APPROVAL NOTICES NOT SENT FOR ANYTHING OTHER THAN STANDARD APPLICATION
PI23036 FILTER TEXT BOXES DISAPPEAR ON RESOURCE TREE WITH JAVA.LANG.NEGATIVEARRAYSIZEEXCEPTION
PI23061 RUN COMPONENT PROCESS STEP GETS SET TO "UNDEFINED"
PI23088 RESTARTED AGENT SHOWS CONNECTED, NOT ONLINE
PI23257 CAN'T SAVE APPLICATION PROCESS THAT REFERENCES A DELETED PROCESS
PI23448 LARGE GENERIC PROCESSES MAY TAKE LONGER THAN EXPECTED TO RUN THEIR FIRST STEP
PI23485 COMPONENT PROCESS SECURED PROPERTIES ARE DISPLAYED IN PLAIN TEXT IN THE OUTPUT.LOG
PI23611 PROPERTY VALUES ARE NOT SAVED FOR PLUGIN STEPS ON URBANCODE DEPLOY 6.0.1.5
PI23732 USER IN TEAMA CANNOT CREATE A CHILD RESOURCE USING TEAM-INHERITANCE FOR TEAMA AND TEAMB
PI23782 CANNOT SAVE AN APPLICATION PROCESS WITH MULTIPLE INSTALL MULTIPLE COMPONENTS.
PI23822 URBANCODE DEPLOY AGENT LEAKS FILE DESCRIPTORS OVER TIME ON JAVA 6
PI24084 RUNNING A GENERIC PROCESS FROM A STEP AGAINST AN OFFLINE AGENT CAUSES THE PROCESS TO RUN FOREVER

Fix Pack 1 (6.1.0.1)
Link Date Released Status

26 June 2014

Superseded

APAR Description
PI13693 THE INVENTORY FOR COMPONENTS IS SHOWING DELETED OLD ENVIRONMENTS AS ACTIVE.
PI15157 ADD RESOURCE TO ENVIRONMENT PANEL HAS 2 VERTICAL SCROLL BARS
PI15734 THE "CURRENTLY DEPLOYED VERSIONS" COLUMN IN COMPONENT VERSION PANEL CAN CREATE CONFUSION FOR USERS
PI17649 DATES IN REVERSE ORDER.
PI17869 AGENTS ARE NOT MARKED AS ONLINE UNTIL THE RELAY IS RESTARTED
PI18115 AGENT STAYS IN CONNECTED STATE DUE TO CLASSPATH ISSUE
PI18648 CAN'T DELETE TEAM MAPPINGS OF OBJECTS WHOSE TYPE HAS BEEN SWITCHED
PI19268 LOG LEVEL ALWAYS AT INFO
PI19546 IMPORT VERSION WITH TEMPLATE GIVES "ERROR CREATING NEW VERSION: NULL"
PI19553 USER INTERFACE BUG WHILE CREATING AN APPLICATION PROPERTY BY EDITING THE BATCH SCRIPT IN URBANCODE DEPLOY 6.0.1.4 IFIX1
PI19734 CANNOT DELETE TEAMS FROM SETTINGS > TEAMS
PI19966 JAVA.LANG.RUNTIMEEXCEPTION: NO HELPER FOUND FOR ELEMENT NAME #COMMENT WHEN TRYING TO SUBMIT APPLICATION PROCESS
PI20154 SELECTING SAVE BEFORE COMPONENT -> EDIT PAGE FINISHES LOADING CAUSES DATA LOSS
PI20256 ITERATION PROPERTIES FROM THE "RUN FOR EACH AGENT" STEP ARE NOT RESOLVED WHEN USING RUN GENERIC PROCESS STEP.

Release 1 (6.1)
Link Date Released Status

12 June 2014

Superseded

APAR Description
PI09997 ATTEMPTS TO USE AN ARTIFACT ID WITH .(DOTS) THE MAVEN RESOLVE STEP RESULTS IN THE WRONG URL BEING GENERATED
PI13094 MISSING DOC ON HOW TO MODIFY UCDEPLOY CONTEXT ROOT
PI13811 RUNNING UDCLIENT RESULTS IN DISPLAYING A JSON REPRESENTATION WIT H GARBLED CHARACTERS IF ANY RESPONSES FROM UCD CONTAINS any DBCS
PI13910 THE DOCUMENTATION OF THE COMMAND PROVISIONENVIRONMENT MISSING INFORMATION
PI15103 GRAY ENVIRONMENT COLOR MAKES IT HARD TO SEE TWISTIE ON LEFT
PI15316 DOCUMENTATION FOR INIT.D NEEDS CHKCONFIG --ADD
PI15408 DEPLOYMENT AVERAGE DURATION REPORT RUNS VERY SLOWLY
PI15531 THE SCROLLBAR IS NOT RENDERING PROPERLY IN THE DEPLOYMENT COUNT WINDOW WHEN THERE ARE MANY ENTRIES
PI15877 INSTALLER FAILS WHEN DATABASE PASSWORD CONTAINS A $
PI16249 THE TABLE PL_SOURCE_CONFIG_EXECUTION KEEPS INCREASING IN SIZE
PI16732 STEPS SHOW MULTIPLE TIMES IN EXECUTION LOG WHEN REFRESHING
PI16878 HOW TO ADD A TEAM TO AN APPLICATION IS NOT DOCUMENTED. THE PERM ISSIONS REQUIRED TO PERFORM THE ACTION IS NOT IN THE INFOCENTER.
PI18145 DOCUMENT THE USE OF PROPERTIES IN THE COMMAND CREATECOMPONENT
PI18166 MISSING HIBERNATE POOL SIZE INFORMATION
PI18784 CONTENTS OF THE VAR/CONFIG DIRECTORY HAS BEEN MIGRATED TO THE DATABASE SERVER

Table of Contents:


Fix Pack 13 (6.0.1.14)
Link Date Released Status

28 June 2016

Current

APAR Description
--

This release contains fixes for security vulnerabilities. Review the following security bulletin for more details:


Fix Pack 13 (6.0.1.13)
Link Date Released Status

8 June 2016

Superseded


Fix Pack 12 (6.0.1.12)
Link Date Released Status

21 December 2015

Superseded

APAR Description
--

This release contains a fix for a security vulnerability. Review Security Bulletin: Multiple XSS Vulnerabilities in IBM UrbanCode Deploy (CVE-2015-7415) for more details.


Fix Pack 11 (6.0.1.11)
Link Date Released Status

24 November 2015

Superseded


Fix Pack 10 (6.0.1.10)
Link Date Released Status

11 September 2015

Superseded

APAR Description
-- Internal fixes

Interim Fix 1 (6.0.1.9_iFix001)
Link Date Released Status

14 August 2015

Superseded

APAR Description
-- This interim fix includes updates to the Java technology that is bundled with the IBM UrbanCode Deploy release on Passport Advantage. Use this interim fix to stay current with the most recent versions of Java.

Fix Pack 9 (6.0.1.9)
Link Date Released Status

10 June 2015

Superseded

APAR Description
-- This release contains a fix for a security vulnerability. Review Security Bulletin: Vulnerability in DHE key exchange algorithm affects IBM UrbanCode Deploy (CVE-2015-4000) for more details.

Fix Pack 8 (6.0.1.8)
Link Date Released Status

26 March 2015

Superseded

APAR Description
-- This release contains a fix for a security vulnerability. Review Security Bulletin: Vulnerability in Apache Tomcat (CVE-2014-0227) for more details.

Fix Pack 7 (6.0.1.7)
Link Date Released Status

04 November 2014

Superseded

APAR Description
-- Fix for a vulnerability in SSLv3 (referred to as the Padding Oracle On Downgraded Legacy Encryption (POODLE) attack). Review Security Bulletin: Vulnerability in SSLv3 affects IBM UrbanCode Deploy (CVE-2014-3566) for details.

Fix Pack 6 (6.0.1.6)
Link Date Released Status

02 September 2014

Superseded

APAR Description
-- Security release to resolve vulnerabilities in Apache Tomcat. Review Security Bulletin: Apache Tomcat Vulnerabilities in IBM UrbanCode Deploy (CVE-2014-0075,CVE-2014-0095,CVE-2014-0096,CVE-2014-0099,CVE-2014-0119) for details.

Fix Pack 5 (6.0.1.5)
Link Date Released Status

29 May 2014

Superseded

APAR Description
PI07346 MAVEN SOURCE CONFIG TYPE CREATES EMPTY VERSIONS
PI10003 RECEIVE ERROR UPON ATTEMPTING TO UPLOAD COMPONENT TEMPLATE .JSON FILE WITH "UPGRADE" CHECKED.
PI12959 ERROR UNIQUE CONSTRAINT VIOLATED WHEN UPGRADING FROM 4.8.5 TO 6.0.1.1
PI13120 THE POST-PROCESSING SCRIPT IN A COMPONENT TEMPLATE IS NOT INCLUDED IN THE EXPORT/IMPORT
PI13129 WEB UI REMOVES ROLE PROPERTIES TABLE AND DOES NOT ALLOW USERS TO SELECT COMPONENTS
PI13708 CONFIGURATION OF PROXY INFORMATION FOR A REMOTE AGENT IS NOT WRITTEN TO INSTALLED.PROPERTIES FILE
PI13771 COMPONENT VERSION IMPORT DIES SILENTLY IF PERMISSIONS ON FILES ARE NOT VALID FOR THE AGENT USER
PI14089 THE UPGRADE PROCESS OF 6.0.1.3 STOPS AT CHANGE #26
PI14091 COMPONENTS COPIED FROM COMPONENTS MADE FROM TEMPLATES DON'T INHERIT PROPERTIES
PI14139 AUTOMATIC VERSION IMPORTS DOES NOT RESUME AFTER DATABASE CONNECTION IS DROPPED
PI14141 CHANGE TO JAVA'S JAVA.POLICY FILE DOES NOT ALLOW DERBY DATABASE TO BIND TO A PORT
PI14360 COMPONENT PROCESS CHANGE HISTORY SHOWS CHANGES FROM OTHER USERS
PI14441 AN INVALID XML CHARACTER WAS FOUND DURING UPGRADE
PI14803 COMPONENT PROCESS CAN BE NAMED LIKE A COMPONENT TEMPLATE PROCESS RESULTING IN INCOMPLETE APPLICATION EXPORT
PI14818 GET_ENVIRONMENT.GROOVY CANNOT OBTAIN AGENT IP ADDRESS WHEN RELAY-AGENT IS IN USED
PI14829 PREVENT IMPORT OF COMPONENT PROCESSES WHICH HAVE THE SAME NAME AS COMPONENT TEMPLATE PROCESSES ON THE COMPONENT
PI14962 MAPPING BLUEPRINT SYNCING CAUSES CONFLICT IN DATABASE
PI15125 SERVER TAKES INCREASINGLY LONGER TO HANDLE AGENT MESSAGES WHEN A VERSION IMPORT ATTEMPT IS IN AN UNEXPECTED STATE
PI15227 SERVER MAY BECOME UNRESPONSIVE IF MORE THAN 40 GENERIC PROCESSES ARE STARTED FROM AN APPLICATION PROCESS SIMULTANEOUSLY
PI15233 A COMPONENT TIES TO A SPECIFIC TEMPLATE VERSION USES THE LATEST PROCESS VERSION AT THE TIME OF EXECUTION
PI15364 AUTOMATIC IMPORTS REMAIN IN WAITING STATE INDEFINITELY
PI15610 NULLPOINTEREXCEPTION WHEN EXPORTING APPLICATIONS
PI15625 CANNOT DELETE COMPONENT TEMPLATE OR GENERIC PROCESS AS NON-ADMIN
PI15750 IMPORTING AN APPLICATION CAN THROUGH A "ERROR IMPORTING APPLICATION: QUERY DID NOT RETURN A UNIQUE RESULT: 2"
PI15773 ERROR IMPORTING APPLICATION, NO READ PERMISSION TO RESOURCE
PI15851 ERROR WHILE UPGRADING: APPLYING 5.0 CHANGE: 55
PI16060 USERS CAN SEE REPORT WITHOUT ANY PERMISSIONS
PI16342 IMPORT OF AN APPLICATION LOSES COMPONENT TEMPLATE PROPERTIES
PI16374 UDEPLOY RANDOMLY CLOSED DATABASE CONNECTION
PI16440 TEAMS ARE LISTED MULTIPLE TIMES IN THE TEAMS DROP DOWN BOX
PI16644 UDEPLOY DEPLOY A SCHEDULED DEPLOYMENT THAT HAS A REVOKED APPROVAL.
PI16939 COMPONENTS NOT SHOWN BENEATH TAG WHEN SORTING COMPONENT LIST BY TAG
PI17071 COMPONENT RESOURCE NAME AND ROLE PROPERTY TABLE DO NOT DISPLAY
PI17219 FOR NON-ADMIN USERS, /REST/AGENT/WRITABLE TAKES A LONG TIME TO RETURN A RESULT
PI17251 /REST/AGENT/NORESOURCE RETURNS AGENTS THAT ARE NO LONGER IN THE SYSTEM.
PI17407 DEPLOYMENT REPORTS ARE TAKING A VERY LONG TIME TO DISPLAY.
PI17682 UNABLE TO TELL WHICH COMPONENT TEMPLATE PROCESS PROPERTY WILL GO TO WHICH COMPONENT
PI17844 ERROR WITH DOWNLOAD ARTIFACTS STEP WHEN "DIRECTORY ARTIFACT OFFSET" SPECIFIED
PI18095 FOLDERS NOT GETTING DELETED USING DOWNLOAD ARTIFACT STEP
PI18170 RUNNING THE UDCLIENT THROUGH AN AGENT RELAY FAILS
PI18545 CANNOT DELETE SNAPSHOTS

Interim Fix 1 (6.0.1.4_iFix001)
Link Date Released Status

27 March 2014

Superseded

APAR Description
PI14695 A GENERIC PROCESS THAT CONTAINS A SIMPLE GROOVY SCRIPT HANGS EVEN THOUGH THE SCRIPT RAN SUCCESSFULLY

Fix Pack 4 (6.0.1.4)
Link Date Released Status

21 March 2014

Superseded

APAR Description
PI09616 ATTEMPTS TO RUN AN APPLICATION THAT CONTAINS "DOWNLOAD ARTIFACTS" STEP RESULT IN "BLOB NOT FOUND FOR HASH SHA-XXXXXXXXXXXXX"
PI11678 AN ERROR HAS OCCURRED MESSAGE WHEN CLICKING ON THE URBANCODE DEPLOY DASHBOARDS TAB
PI11821 FILE COMPARE DOES NOT DISPLAY PROPERLY.
PI11892 NO DIALECT MAPPING FOR JDBC TYPE: -9 WHEN SAVING A RESOURCE
PI12282 COMPONENTS' FILTER DOES NOT WORK IN V6.0.1.3
PI12367 RESTARTING TOMCAT PRODUCES THE FOLLOWING ERROR: ORA-01795: MAXIMUM NUMBER OF EXPRESSIONS IN A LIST IS 1000
PI12587 COMPONENT DROPDOWN LISTS ARE NOT POPULATED WHEN MAPPING LOWER LEVEL RESOURCES TO ENVIRONMENTS OR BLUEPRINTS
PI12814 UDCLIENT RESULTS IN NULLPOINTEREXCEPTION WHEN RUNNING PROVISIONENVIRONMENT
PI12988 TRYING TO IMPORT/EXPORT AN APPLICATION WITH A RESOURCE TAG RESULTS IN AN ERROR
PI13113 ATTEMPTS TO RUN UDCLIENT INSTALLAGENT RESULTS IN A JAVA.LANG.NOCLASSDEFFOUNDERROR: ORG.APACHE.COMMONS.LANG3.STRINGUTILS
PI13294 THE MAVEN RESOLVE PLUGIN DOES NOT HAVE THE ABILITY TO CONFIGURE A PROXY
PI13386 LOG4J.PROPERTIES DOES NOT EXPLAIN CORRECTLY HOW TO ENABLE AUDIT LOGGING
PI13397 ERROR AFTER CREATING APPLICATION, WHEN USING MICROSOFT SQL SERVER
PI13503 CANNOT ADD A NEW ENVIRONMENT TYPE TO AN APPLICATION
PI13839 REQUESTED DEPLOYMENTS TAKE A VERY LONG TIME TO START
PI10541 ATTEMPTS TO IMPORT AN APPLICATION INTO UDEPLOY RESULTS IN A JAVA.LANG.NULLPOINTEREXCEPTION
PI13980 AGENTS COME ONLINE BY THEIR AGENT.ID AND NOT BY THEIR NAME

Fix Pack 3 (6.0.1.3)
Link Date Released Status

17 February 2014

Superseded

APAR Description
PI04998 AGENT SERVICE NAME DOESN'T ALLOW SPACES
PI06963 RUNNING SQLSERVER RESULTS IN COM.MICROSOFT.SQLSERVER.JDBC.SQLSERVEREXCEPTION ERRORS
PI09024 KEYERROR: RAFW_TYPE WHEN RUNNING GENERATE TEMPLATE IN MCWAS V3 PLUGIN
PI09287 THE "WAIT FOR SERVER OF CLUSTER" STEP TIMES OUT INSTEAD OF FAILING IF THE TEMP.PY FILE IS DELETED.
PI09300 "VERIFY DEPLOYMENT" STEP FAILS IF THE HTML FILE SPECIFIED IN THE URL WAS SAVED WITH JAPANESE ENCODING
PI09418 UPGRADE FROM 6.0.1 TO 6.0.1.1 FAILS IF BACKEND DATABASE WAS DB2
PI09426 "EXPAND ALL" BUTTON IS NOT WORKING ON THE APPLICATION ENVIRONMENT PAGE.
PI09728 THE STEP TREE VIEW ALWAYS COLLAPSES WHEN FOLLOWING THE EXECUTION OF A DEPLOYMENT USING URBANCODE DEPLOY V6.0.1.1
PI10003 RECEIVE ERROR UPON ATTEMPTING TO UPLOAD COMPONENT TEMPLATE .JSON FILE WITH "UPGRADE" CHECKED.
PI10111 SELECT FOR ALL > LATEST AVAILABLE, DEPLOY SERVER WILL NOT SET THE LATEST VERSION.
PI10545 AFTER UPGRADE FROM UDEPLOY 4.8.5 TO 6.0.1.1, CAN'T EXPORT SOME APPLICATIONS AS A REGULAR USER
PI10525 APPLICATION PROCESS PROPERTIES ARE DISPLAYED USING THEIR NAMES INSTEAD OF LABELS
PI10722 SCHEDULING APPLICATION REQUESTS WITH COMPONENTS WITH MANY VERSIONS TAKES A LONG TIME.
PI10820 DEPLOY COULD NOT SAVE MULTIPLE COMPONENT TAG CORRECTLY
PI10756 JBOSS PLUGIN V7 RUN_SCRIPT.GROOVY CANNOT BE EXECUTED. NO SIGNATURE OF METHOD: JAVA.LANG.UNIXPROCESS.CONSUMEPROCESSOUTPUT()
PI10820 DEPLOY COULD NOT SAVE MULTIPLE COMPONENT TAG CORRECTLY
PI10852 APPLICATION PROCESS PROPERTIES DO NOT RESOLVE
PI11200 LOCKED SNAPSHOT USES THE NEWEST VERSION OF ANY PROPERTIES WHICH ARE INHERITED FROM PARENT RESOURCE
PI11202 LOCKED SNAPSHOT PICKS LAST VERSION OF ANY PROPERTIES
PI11314 ATTEMPTS TO VIEW REQUESTS RESULTS IN THE PAGE NOT LOADING
PI11624 APPLICATION REQUESTS AND COMPLIANT RESOURCE VIEWS ARE EXTREMELY SLOW
PI11631 SLOWNESS IN MANY LOCATIONS IN THE UI
PI11731 UPGRADE FROM 4.8.5. TO 6.0.1.1 FAILED: ORA- 00001: UNIQUE CONSTRAINT VIOLATED

Fix Pack 2 (6.0.1.2)
Link Date Released Status

20 January 2014

Superseded

APAR Description
PI06734 REQUIRE ROLE IS MISSING FROM PROCESSES
PI08797 NO SIGNATURE OF METHOD CREATECOMPONENTMAPPING THAT TAKES 3
PI08898 UDCLIENT ADDVERSIONFILES ALWAYS REQUIRES COMPONENT NAME
PI08901 COPYING RESOURCES DOES NOT COPY IMPERSONATION DETAILS
PI08903 COPYING RESOURCE DOES NOT COPY NESTED RESOURCES
PI08926 AUTOINTEGRATION RUN PROCESS FEATURE DOES NOT WORK
PI09446 RESOURCE PROPERTY DEFINITIONS DO NOT GET COPIED WHEN COPYING A COMPONENT.

Fix Pack 1 (6.0.1.1)
Link Date Released Status

31 December 2013

Superseded

ID Description
29410 Importing an Application Process fails with NullPointerException and no indication of what is missing
29774 URBANCODE AGENT IS NOT ABLE TO GO ONLINE WHEN '.BAT' IS MISSING FROM THE PATHEXT ENVIRONMENT VARIABLE ON MICROSOFT WINDOWS
29425 GET ENVIRONMENT PROPERTIES FAILS USING IMPERSONATION
29754 TRY SUPPLYING A PROCESS PROPERTY AT RUNTIME DECLARED IN THE COMP ONENT OR APPLICATION PROCESS PROPERTIES MAY RESULT IN UNRESOLVED
32824 RUN UAGENT AS A WINDOWS SERVICE, THE AGENT'S STATUS IS NOT "ONLINE"
32818 TABLE EDIT PRODUCES \N INSTEAD OF LINE-BREAKS AFTER USING BATCH EDIT ON MULTI-LINE PROPERTIES
33850 UPGRADING URBANCODE DEPLOY FROM VERSION 5 TO 6 FAILS WITH THE ERROR ORA-00955: NAME IS ALREADY USED BY AN EXISTING OBJECT
33866 ENVIRONMENT GATES ARE NOT EXPORTED WHEN EXPORTING AN APPLICATION
35976 AFTER UPGRADING DEPLOY SERVER FROM V6 TO V6.0.1, TEAM OBJECT MAPPING FAILS TO PICKUP APPLICATIONS' NAME.
35940 RUN IF COMPONENT(S) CHANGE FAILS TO DETECT CHANGES
36497 THE INSTALL TEMPLATE STEP OF CONFIGURATION MANAGEMENT PLUGIN THROWS A MISSING CLASS ERROR
36439 UPDATE LDAP USERS FEATURE FAILS WITH NETWORKERROR: 405 METHOD NOT ALLOWED
37566 ATTEMPTS TO IMPORT NEW VERSIONS INTO A COMPONENT WHOSE NAME CONTAINS DOUBLE BYTE CHARACTERS RESULT IN A JAVA.LANG.EXCEPTION

Mod Pack 1 (6.0.1)
Link Date Released Status

27 November 2013

Superseded

ID Description
PI04903 CREATEENVIRONMENTPROPERTY REQUIRES THE APPLICATION EVEN WITH ENVIRONMENT ID
17602 ATTEMPTS TO CHANGE (ADD/EDIT/DELETE)TEAMS FOR TOP-LEVEL RESOURCE GROUPS ARE NOT SAVED
17926 ERROR "JAVAX.NET.SSL.SSLPEERUNVERIFIEDEXCEPTION: PEER NOT AUTHENTICATED" AFTER UPGRADE
18066 ATTEMPTS TO EXPAND THE APPROVALS ON THE APPROVAL PROCESS TAB RESULTS IN THE APPROVALS NOT EXPANDING
18474 SECURITY CONFIGURATION DOES NOT PROPAGATE TO RESOURCES IN THE GROUP
18489 UPGRADE FAILS WITH ERROR: INCORRECT SYNTAX NEAR 'DROP'.
18801 ATTEMPTS TO DEPLOY A FILE WHOSE NAME CONSISTS OF DOUBLE BYTE CHA RACTERS USING URBANCODE DEPLOY V6.0 RESULTS IN GARBLED FILE NAME
19392 RUNNING A REPORT RESULTS IN NULLPOINTEREXCEPTION
19491 RESOURCE GROUP READ AND EXECUTE PERMISSIONS ARE NOT INHERITED BY RESOURCES IN THE GROUP
19914 ATTEMPTS TO OPEN A TEMPLATE COMPONENT PROCESS AFTER UPGRADING TO UDEPLOY 5.0 RESULTS IN A NULLPOINTEREXCEPTION
26008 USER WITHOUT READ PERMISSIONS ON RESOURCE SEES "AN ERROR HAS OCCURRED" ON DASHBOARD WHEN GENERIC PROCESS IS RUNNING
26030 DELETING A ROLE REQUIRED TO MAKE APPROVAL BREAKS WORK ITEMS TAB
26448 CREATEENVIRONMENTPROPERTY REQUIRES THE APPLICATION EVEN WITH ENVIRONMENT ID
26978 PROMPTING UNNECESSARILY FOR NON-REQUIRED PROPERTIES
27619 CLEAN UP RESULTS IN JAVA EXCEPTIONS ERRORS "ERROR REMOVING REFERENCE FOR SHA-256{DF8448BFB2***C7D820}
28349 WINDOWS FAILOVER CLUSTERS V.3.343297 REPORTS SUCCESS EVEN WHEN CLUSTER RESOURCE FAILS TO COME ONLINE
28373 ENVIRONMENT COMPONENT PROPERTIES ARE BEING SET TO DEFAULT VALUE DURING IMPORT OF APPLICATION USING IBM UrbanCode UDEPLOY
28375 DOWNLOAD ARTIFACTS THROWS "BLOB NOT FOUND FOR HASH SHA-XXXXXXXXXXXXX"
28391 ATTEMPTS TO VIEW A COMPONENT'S PROPERTY RESULTS IN THE PROPERTY' S CURRENT VALUE BEING RETURNED, NOT THE VALUE DURING DEPLOYMENT.
28470 EVEN IF THE PREFERENCE IS SELECTED AS UK FOR THE LOCALE SETTINGS, DATE FORMAT STAYS IN THE US FORMAT.
28526 DS_SA_MESSAGE CONSTRAINT VIOLATION
28527 UD SERVERS IN HA CAN'T HANDLE VERSION FILE IMPORT SESSION FAILOVER
28529 REMOVING A USER IS SOMEHOW ACTUALLY DELETING THE ROW INSTEAD OF SETTING THE GHOSTED DATE.
28584 TWO LOCKABLE OBJECTS CAN BE CREATED WITH THE SAME NAME
28591 RESOURCE PROPERTY INHERITANCE IS INCORRECT
28621 THE OUTPUT OF A COMPONENT EXPORT IS INCOMPLETE
28721 AGENTS STATUS REPORTED INCORRECTLY WHEN AN AGENT RELAY GOES OFFLINE
28722 CLI REQUESTAPPLICATIONPROCESS COMMAND CANNOT SCHEDULE FOR 12:00PM-1:00PM
28733 DUPLICATE EMAILS BEING SENT FOR APPLICATION PROCESS SUCCESS
29252 COMPONENT TEMPLATE PROCESS DESIGN CONFIGURATION TAB MISSING OPTIONS TO CONFIGURE BASIC PROCESS SETTINGS
29356 UDEPLOY STARTS UP BUT UDEPLOY WEB UI SERVICE PORTS INTERMITTENTLY NOT SHOWING UP ON SERVER
29411 SPECIAL CHARACTERS IN FIELDS PREVENT COMPONENTS AND ENVIRONMENTS FROM LOADING using IBM UrbanCode Deploy v6.0
29570 ROLE CONFIGURATION IS NOT PERSISTENT
29775 EXPORTING A COMPONENT TEMPLATE THAT CONTAINS THE RUN COMPONENT PROCESS STEP CAUSES A NULL POINTER EXCEPTION
30877 APPLICATION PROCESS RUNS INDEFINITELY AFTER REJECTING MANUAL TASK
31073 CLICKING ON THE AUDIT LINK CAUSES JAVA OUT-OF-MEMORY ERRORS

Initial Release (6.0)
Link Date Released Status

06 September 2013

Superseded


Related information

V.R.M.F. Maintenance Stream Delivery Vehicle glossary
Software Product Compatibility Reports
Fix Central

Cross reference information
Segment Product Component Platform Version Edition
Cloud and Virtualization Management IBM UrbanCode Deploy Installation AIX, Linux, Solaris, Windows 6.1, 6.1.1, 6.1.2, 6.1.3, 6.2, 6.2.1, 6.2.2, 6.2.3.0, 6.2.4

Document information

More support for: IBM UrbanCode Deploy
Installation

Software version: 6.0, 6.0.1, 6.0.1.1, 6.0.1.2, 6.0.1.3, 6.0.1.4, 6.0.1.5, 6.0.1.6, 6.0.1.7, 6.0.1.8, 6.0.1.9, 6.0.1.10, 6.0.1.11, 6.0.1.12, 6.0.1.13, 6.0.1.14, 6.1, 6.1.0.1, 6.1.0.2, 6.1.0.3, 6.1.0.4, 6.1.1, 6.1.1.1, 6.1.1.2, 6.1.1.3, 6.1.1.4, 6.1.1.5, 6.1.1.6, 6.1.1.7, 6.1.1.8, 6.1.2, 6.1.3, 6.1.3.1, 6.1.3.2, 6.1.3.3, 6.1.3.4, 6.1.3.5, 6.1.3.6, 6.2, 6.2.0.1, 6.2.0.2, 6.2.1, 6.2.1.1, 6.2.1.2, 6.2.2, 6.2.2.1, 6.2.3.0, 6.2.3.1, 6.2.4, 6.2.4.1

Operating system(s): AIX, HP-UX, Linux, OS X, Solaris, Windows, Windows Mobile, z/OS

Reference #: 7038759

Modified date: 11 April 2018