IBM Support What's New?

Fix list for Rational Developer for System z

Product documentation


Abstract

This document contains a complete listing of IBM Rational Developer for System z fixes with the most recent fix at the top.

Content

Tab navigation

IBM Rational Software Support Communities
  • Visit the IBM Support Portal to configure your support portal experience and review FAQs, lists of known problems, fixes, and a wealth of important support information.
  • Visit developerWorks to access an online collection of tutorials, sample code, standards, forums and other resources provided by experts at IBM to assist software developers using Rational tools including access to the IBM RFE Community.
  • Visit the Jazz Community if you use a Rational product created using the Jazz platform to interact directly with the Jazz development team and other community members, download product trials and betas and track development progress.

Helpful Hints For Obtaining Technical Assistance:

Before you contact IBM Rational Software Support, gather the background information that you need to describe the problem. When you describe a problem to an IBM software support specialist, be as specific as possible and include all relevant background information so that the specialist can help you solve the problem efficiently. To save time, know the answers to these questions:

  • What software versions were you running when the problem occurred?
  • Do you have logs, traces, or messages that are related to the problem?
  • Can you reproduce the problem? If so, what steps do you take to reproduce it?
  • Is there a workaround for the problem? If so, be prepared to describe the workaround.

If you have helpful information to diagnose or identify the problem on your system, you can provide this data by following the instructions to exchange information with IBM Technical Support.

Follow IBM Rational Client Support on Twitter | Facebook | YouTube | devWorks Blog

Table of Contents:


8.5.x iFix 8 Java Platform Update
Link Date Released Status
APAR Description
-- IBM Java Platform Standard Edition 7 Service Refresh 9 Fix Pack 40 - Multiple vulnerabilities in IBM Java SDK affects Rational Developer for System z (CVE-2016-0363 and CVE-2016-0376)

8.5.x iFix 7 Java Platform Update
Link Date Released Status
APAR Description
-- IBM Java Platform Standard Edition 7 Service Refresh 9 Fix Pack 30 - Vulnerability in IBM Java SDK affects Rational Developer for System z (CVE-2015-7575)

8.5.x iFix 6 Java Platform Update
Link Date Released Status
APAR Description
-- IBM Java Platform Standard Edition 7 Service Refresh 9 Fix Pack 20

8.5.1.6 iFix 1
Link Date Released Status
APAR Description
-- Open Source Apache Batik vulnerability affects Rational Developer for System z (CVE-2015-0250)

8.5.x iFix 5 Java Platform Update
Link Date Released Status
APAR Description
-- IBM Java Platform Standard Edition 7 Service Refresh 9 Fix Pack 1

8.5.x iFix 4 Java Platform Update
Link Date Released Status
APAR Description
-- IBM Java Platform Standard Edition 7 Service Refresh 9

8.5.x iFix 3 Java Platform Update
Link Date Released Status
APAR Description
-- IBM Java Platform Standard Edition 7 Service Refresh 8+IV70681

Fix Pack 6 (8.5.1.6)
Link Date Released Status
APAR Description
PI15244 Debugger generates NULLPOINTEREXCEPTION and then fails to jump to the next breakpoint after pressing F8
PI15268 Systematic NULLPOINTEREXCEPTION when opening a PL/I file from the repository files view
PI16234 Warning shown when parsing CICS statement if it is coded inside a copybook
PI17526 LPEX rectangle mark (ALT+R)*2 copy and paste function causes output to be garbage after save
PI21030 Process of 'Update Endevor Cache" is held up
PI21394 PL/I outline view empty when using %DO %END statements
PI21627 Use of SPECIAL-NAMES causes errors in editors and software analyzer
PI21846 In COBOL programs, keywords 'NEW' and 'OLD' are marked as errors
PI22312 LPEX editor displays syntax error within the ASM instruction JC
PI22331 PL/I editor gives yellow underscored warnings claiming a procedure end is missing
PI22443 CARMA Endevor RAM customization for disabling "Bypass Generate Processor" not working
PI22693 Client may hang when using software analyzer
PI22883 PL/I outline view incorrectly shows nested proc
PI23289 Blocking CDT error on startup after a Windows automatic lock
PI24009 Remote z/OS search query returns empty results when re-executed
PI24191 PL/I editor: CompoundAssignOp is Invalid
PI24626 Cannot add an action when creating menu manager complex remote action
PI25332 Remote Syntax Check does not honor the OR(!) option in PL/I macros
PI25398 Variable DEBUG-NAME is not recognized in Editors
PI27754 Browse action for BMS files does not work correctly
PI28588 JESJobUtil API, getContents and getContentString return unexpected results
PI29030 In the LPEX Editor, after a 'Replace all', 'Undo' action, the first occurrence will be missed
PI29045 Client closes LPEX editor when connection times out
PI30455 After a disconnect from a debug session, the subsequent debug sessions may show delays stepping through breakpoints
PI31087 BMS Editor not sorting fields by row and column position when saved
PI31317 com.ibm.ftt.resources.core.physical.IPhysicalResource.refresh() sometimes does not work for offline volumes
PI32078 TSO shell incorrectly translates "& lt;" and "& gt;" strings to "<" and ">"
PM88523 LPEX shifts source code to the left after minimize/maximize
PM93195 In SCLM, real-time syntax check does not recognize some operators
PM93529 Export and upload actions do not display error message when there is no disk space
PM97703 Paragraph is not inserted using the Quick Fix function in the COBOL Editor

Host - Fix Pack 6 (8.5.1.6: UI24911 PTF)
Link Date Released Status
APAR Description
PI21477 Internal defects and enhancements - RSE
PI21509 Internal defects and enhancements - non RSE
PI21923 Remote search results incomplete when using -Dsearch.server.limit.datasets=nnn
PI22155 Client connection fails to terminate after disconnect
PI22575 Abend 0C4 in function putFile()
PI25019 Generated SCL on ENDEVOR API calls include field spaces/padding not inputted by the user
PI25632 Abend with completion code 0C1 in function closeOutputFile
PI25647 Enhancement to control CARMA CRASTART startup tracing
PI25785 Abends with completion codes of U4039 and U4091 during remote search
PI26755 Running the RSE DAEMON IVP multiple times results in error: THREADPOOLMONITOR:JAVA NPE
PI26973 A TSO command through APPC may fail with error: "ERR: Receive of Host IP, port"
PI28633 ERROR ServerThread: Exception when the hostname and the system name are not the same
PI31696 LOCK Daemon cannot be stopped
PI32076 0C4 abend in openInputMember in libfekfmain.so
PI13750 Client hangs for 2 minutes when connection times out or is cancelled during edit in LPEX

8.5.x iFix 2 Java Platform Update
Link Date Released Status
APAR Description
-- IBM Java Platform Standard Edition 7 Service Refresh 8+IV66375

8.5.x iFix 1 Java Platform Update
Link Date Released Status
APAR Description
-- IBM Java Platform Standard Edition 7 Service Refresh 7 Fix Pack 1

Host - Fix Pack 5 (8.5.1.5: UI18898 PTF)
Link Date Released Status
APAR Description
PI04831 Rational Developer for System z Defects/Enhancements: Click on APAR link to view list of defects/enhancements
PI05593 Rational Developer for System z Defects/Enhancements: Click on APAR link to view list of defects/enhancements
PI06385 CARMA startup fails when using CLIST startup method with the new (8 parameter) format
PI06665 Data Editor feature 'Find and Replace All' will fail with large data sets
PI08917 GRS contention is held if delete of member is attempted and failed multiple times
PI09008 CARMA Endevor Enhanced Edit of production element copies all versions to new/entry environment
PI09130 RDz 8.5.1.4 wrongly uses the RDz 9.0 log naming convention for the rsedaemon.log
PI09242 "Remote System Details" view does not show the User ID as Lock owner
PI10866 Copy member in PDS doesn't retain member attributes
PI11076 Specific user's process does not end when the user disconnects
PI11186 JCL Submit fails with Error: Check JES to verify: Command Failed (2005)
PI11196 Rational Developer for System z Defects/Enhancements: Click on APAR link to view list of defects/enhancements
PI11525 File descriptors are still open after users have disconnected from Rational Developer for System z
PI13633 Rational Developer for System z Defects/Enhancements: Changes to CARMA Endevor CRADEF RAM file are not reflected in the Rational Developer for System z client user interface and CRAEXIT receives faulty client version
PI13738 Rational Developer for System z Defects/Enhancements: Click on APAR link to view list of defects/enhancements
PI14834 Display client returns false results V7.6.X clients
PI20631 Rational Developer for System z Defects/Enhancements: Click on APAR link to view list of defects/enhancements
PM91989 Deleted z/OS files are shown in Remote Systems view filter after refresh

Fix Pack 5 (8.5.1.5)
Link Date Released Status
APAR Description
PI05023 LPEX action deleteLine does not output deleted line to killring
PI05581 When creating a view in the CARMA repositories view, the new name is malformed
PI05588 In LPEX Editor, dividing a column using enter key will repeat the previous char
PI06264 When editing a copybook file, the LPEX Editor marks COPY keyword with '"TextNameliteral" expected after this token'
PI06672 Error CRIMC1037E when updating Rational Developer for System z 8.5.1.4
PI06908 Unable to map A: or B: to network drive through RSE in Rational Developer for System z 8.5.1.4
PI07612 CARMA enhanced edit for Endevor results in lost edit changes when a line truncation error occurs
PI09049 Unable to perform 'SUBMIT' action on CARMA Endevor 'non-standard' PDS members
PI09053 Comparing two PL/I files results in an exception
PI09202 Remote z/OS Search "Add Query" icon is disabled when 'List cancelled' is shown in the result
PI09352 PushToClient export action not working for zossys.xml
PI09649 Error message RSFE1002 received instead of a connection dialog box
PI11052 Work offline produces null pointer exception when data sets/members not available
PI11143 Menu Manager does not recognize data set defined with $ character
PI11809 Version 8.5.0 and 9.0.0 LPEX editor behaves differently than previous versions
PI11823 Delete member of a subproject fails
PI11961 When debugging disassembly, the Debugger Editor's contents are not correctly updated with dynamic changes to the assembler
PI12156 Renaming a member in a large PDS causes high CPU usage
PI12672 COBOL Editor with Format action incorrectly formats the COBOL file
PI12897 CARMA Endevor MVS Subproject association does not change after element "saved" into another Environment
PI13123 Depending on the copy/paste method, accents are kept or not kept
PI13254 When the Outline parser crashes, an exception is logged
PI13403 Unable to recover a MVS project with an invalid character in the project name
PI13750 Client hangs for 2 minutes when connection times out or is cancelled during edit in LPEX
PI13945 Control flow fails due to CRRZJ004E Unexpected error - Excessive control Flow iteration
PI13956 Running Code Coverage Results in Unexpected Empty Reports
PI14636 Real Time Syntax Check gives "area expected after this token"
PI14637 Real Time Syntax Check gives errors with PL/I DCL ENTRY
PI15481 Editors do not recognize CICS INITIMG (SPACE)
PI15782 No message when failing to open sequential locked data set
PI17242 IMS Web service generated PLI converter uses builtin function already declared as variable
PI17283 COBOL real time syntax check does not support the "IN" keyword in "MOVE LENGTH IN"
PI17524 "Program control flow" may show incorrect results when ON EXCEPTION clause is used
PI17970 CARMA CRAEXIT is not being passed the correct client version/fixpack level
PI19085 Rational Developer for System z 8.5.1.4 client disconnects from Rational Developer for System z host 9.0.1 when Keepalive is disabled
PI19933 Rational Developer for System z Enterprise: 8.5.1.4 client displays syntax error message using the COBOL editor from the AIX perspective
PM88338 File>Save As does not work for BMS Maps
PM92560 Content Assist for PL/I does not propose the complete data area name list in some cases
PM93026 Color preference lost on each restart
PM94529 Client allows reselection of product group after cache is cleared
PM97526 CARMA client provides wrong Endevor stages in drop-down list on New Endevor view panel
PM98082 Update element dialog isn't displayed when clicking on save
PM98217 Do not display "Missing Property Group" dialog while debugging source that does not have an associated property group
PM98309 Syntax check error in CICS WEB SEND statement when CHUNKING CICS value data area (cvda) uses DFHVALUE
PM98898 LPEX Editor displays syntax error for ASM instructions
PM99013 Content Assist option missing when PL/I structures are based on a pointer
PM99715 Double-click the error from the Remote Error List view fails with error

Interim Fix 1 (8.5.1.4_iFix001)
Link Date Released Status
APAR Description
PI05833 Rational Developer for System z: CTRL key mapped to Enter is sent to all Host Connect windows in Rational Developer for System z
PI06785 Rational Developer for System z: Copy/paste done within HCE session, '?' appears at the end of the 'pasted' content. Backport for APAR PM93194

Host - Fix Pack 4 (8.5.1.4: UK98515 PTF)
Link Date Released Status
Host APARs Description
PM82962 Rational Developer for System z: Internal v8.5.1.4 defects/enhancements: - FEKLOGS error processing path with $-char - place RDz first in PATH for IVPs - CfgUtil failure with RDz directories containing $ char - Compare in history view from SCLM does not work - UnsupportedEncodingException filetag for C code
PM82967 Rational Developer for System z: Internal v8.5.1.4 defects/enhancements: - JMON: bind to loop-back only - JMON doesn't tell result to the operator - JMON STORAGE operator command gives no data - JMON: bind to loop-back only - JMON connect fails on alternate IP stack - job filter expansion performance improvement - add LOOPBACK_ONLY=ON - remove _BPXK_SETIBMOPT_TRANSPORT=TCPIP
PM85803 Rational Developer for System z: Timeout errors with opening PDS data sets
PM85959 Rational Developer for System z: Internal v8.5.1.4 defects/enhancements: - provide method for CARMA startup to know client level - default open CARMA member action 851 host + 803 client - provide method for miners to know client level - DEBUG GC operator command - pass on client version during startup and act upon it - CRASRV.properties user.exit
PM85970 Rational Developer for System z: Internal v8.5.1.4 defects/enhancements: - limit search to limit CPU usage - reserve causing 213-30 - FEK210I message gives a wrong impression - logon fails with EDC5140I Broken pipe - RSE daemon IVP fails - duplicate usage of FEK100E - FEK106E = No Resource Bundle of {0} - corrupted SSL connection - more abend 213-30 after PM80961 - improve synchronization mechanism to update dataset - new message for zOS RESERVE failed - operator cmd RDL 1 and RSL 1 not supported - member locked - _RSE_JAVAOPTS -Dsearch.server.limit.hits=300 - _RSE_JAVAOPTS -Dsearch.server.limit.datasets=200 - _RSE_JAVAOPTS -Dsearch.server.limit.lines=100000 - various rsed.envvars updates - _RSE_JAVAOPTS -Dsearch.server.limit.hits=0 - _RSE_JAVAOPTS -Dsearch.server.limit.datasets=0 - _RSE_JAVAOPTS -Dsearch.server.limit.lines=0 - _RSE_JAVAOPTS -Dsearch.server.limit.timeout=0 - _RSE_JAVAOPTS -DDISABLE_TEXT_SEARCH=true - dyn alloc fails on ISPF work datasets with reason 528 - DISABLE_TEXT_SEARCH is not supported in V80 & up - high CPU for long running search
PM86394 Rational Developer for System z: When JOBCARD skeletal JCL member used for Endevor batch actions, last line suppressed
PM89085 Rational Developer for System z: Submit fails when total length of PDS (member) > 44 characters
PM89182 Rational Developer for System z: Error message CRRZI0487E if 'PL/I logical NOT symbol' is specified in the file mapping
PM89228 Rational Developer for System z: Permissions of the first logon user is retained for any subsequent user
PM89780 Rational Developer for System z: Internal v8.5.1.4 defects/enhancements: - zombie ServerIdleThread on disconnect - started task ID invoking ISPZINT - change ServerIdleThread so that it can extend SecuredThread - RDz requires audit log for USS operations - new server audit log requirements
PM91529 Rational Developer for System z: Internal v8.5.1.4 defects/enhancements: - provide method for CARMA RAM to know client level - CARMA client level only passed when using *CRASTART - new CRASERV directive user.exit=dsn(member) - lines with non-displayable chars are truncated - transfer method not allowed during Enhanced edit - new DD CRACFG - CRACFG ENTRY-STAGE-COPY-MODE - new PARMLIB(CRACFG) - CARMA CRASTART program line has line length issue - CARMA CRASTART: supports only 8 parms, not 9 - CARMA client level only passed when using *CRASTART - allow CARMA user exit to interrupt CARMA startup - typo in crastart.conf
PM92271 Rational Developer for System z: Print a member in CARMA/Endevor fails with error "INVALID NAME SPECIFIED"
PM92381 Rational Developer for System z: Internal v8.5.1.4 defects/enhancements: - problem with NLS characters in zUnit messages - new parm CLOCALE / -l
PM92416 Rational Developer for System z: CARMA fast edit does not retrieve dependencies
PM94959 Rational Developer for System z: RSED started task consuming high amounts of CPU
PM95640 Rational Developer for System z: Compress accesses SYS1.LINKLIB
PM96296 Rational Developer for System z: S378-14 abend occurs when starting RDz on host with DIAGxx tool options enabled
PM97390 Rational Developer for System z: Trace causes performance problem due to excessive trace output for the trace points in findBadHex()
PM98147 Rational Developer for System z generates password violations when using ACF2 when -DAPPLID is commented out

Client - Fix Pack 4 (8.5.1.4)
Link Date Released Status
APAR Description
PM64168 Rational Developer for System z: Error occurs when JCL contains Yen symbol and is submitted from the editor
PM79956 Rational Developer for System z: Outline view incorrect when using partial sourceline %include on a source statement that spans multiple lines
PM82980 Rational Developer for System z: Incorrect Content Assist error when a diacritic character (äèú..) is in the sequence number (columns 73-80)
PM83152 Rational Developer for System z : A disconnect should close the edit session in the LPEX editor
PM83833 Rational Developer for System z: A right-click on a shared project with CARMA will give a NullPointerException
PM84060 Rational Developer for System z: Editors flag SQL .. CLOB expansion in error
PM84266 Rational Developer for System z: Reserved words AS or ATTRIBUTES are not reserved
PM84568 Rational Developer for System z: Program Control Flow gives CRRZJ0004E on SEARCH statement
PM85099 Rational Developer for System z: The symbol UNAL in a PL/I procedure is not recognized by the real-time syntax check parser
PM85884 Rational Developer for System z: COBOL parser shows an unexpected error for the exponentiation operator ("**") when followed by a unary negative expression
PM86061 Rational Developer for System z: COBOL Editors, Remote pre-processor inserts double SQLCA
PM86150 Rational Developer for System z: Scandic characters are not correctly displayed when creating new element in Endevor
PM87015 Rational Developer for System z: When Refactor is performed on a COBOL/PLI program in the System z LPEX editor, the client hangs
PM87178 Rational Developer for System z: In the MFS editor, a NullPointerException occurs when accessing Extend Attributes tab
PM87606 Rational Developer for System z: Bad restitution of some characters shown in include files via hover (PL/I source)
PM87921 Rational Developer for System z: Danish characters cause syntax errors in PL/I real time syntax checker
PM88333 Rational Developer for System z: Real time syntax check doesn't flag non-numeric
PM88407 Rational Developer for System z: Unable to connect to RDz host 8.0.3.3 using RDz client 8.5.1 with SSL
PM88476 Rational Developer for System z: CARMA Endevor client receives 'An internal error occurred during: "Define Package"'
PM88869 Rational Developer for System z: PL/I program has empty Outline View
PM88895 Rational Developer for System z: CARMA Endevor association lost on element/member in MVS subproject after restart
PM88967 Rational Developer for System z: Code coverage gives incorrect execution status for PL/I with ON ENDFILE
PM89291 Rational Developer for System z: Split Line (ALT+S) within LPEX moves line into incorrect columns
PM89572 Rational Developer for System z: COPY REPLACING invalid syntax
PM89656 Rational Developer for System z: Outline view does not show a PL/I proc correctly if it has a preprocessor statement without ; before the end of the procedure
PM89905 Rational Developer for System z: Remote Error List view sort by date column fails
PM89949 Rational Developer for System z: Outline view will not be displayed for some PL/I files
PM90074 Rational Developer for System z: Deploy CICS bundle wizard shows Web service as possible connection
PM90368 Rational Developer for System z: A disconnect/reconnect in the Remote System perspective does not save a library mapping
PM90376 Rational Developer for System z: PL/I Template with commented out lines does not expand correctly
PM90398 Rational Developer for System z: PL/I null subscript references are generated for elementary base64Binary arrays
PM90489 Rational Developer for System z: Open Program option not available within CICS LINK or XCTL statements
PM90889 Rational Developer for System z: Copy/Paste of one line is not working in the LPEX editor using ISPF mode when using CTRL V
PM90941 Rational Developer for System z: Project content is lost after delete/recreate of connection
PM90981 Rational Developer for System z deletes subproject and additional selected members without warning
PM90986 Rational Developer for System z: Local PL/I compiler does not support UTF-8
PM91028 Rational Developer for System z: Block mode section does not paste properly in ISPF editor
PM91320 Rational Developer for System z: CARMA Endevor package comments not shown when opened with Endevor Package editor
PM91401 Rational Developer for System z: If an include file contains a package or procedure declaration, inappropriate folding locations may appear in the PL/I editor
PM91427 Rational Developer for System z: Program Control Flow should show SORT procedures
PM91447 Rational Developer for System z: Remote z/OS search using a regular expression to search for a member name causes a hang
PM91807 Rational Developer for System z: New CARMA Endevor Package is listed under wrong view/filter
PM91814 Rational Developer for System z: Hover information not available when program begins and/or ends with copy statement or identified preprocessor statement
PM91820 Rational Developer for System z: New -> Endevor Package dialog ignores 'Remember the entered values for later'
PM91857 Rational Developer for System z: "Outline" view does not display correctly the procedure for some PL/I members
PM92024 Rational Developer for System z: Changing PDS member file extension fails to persist
PM92045 Rational Developer for System z: IGYDS0027-S with Local Syntax Check on a COBOL 4.2.0 variable name with an underscore character
PM92180 Rational Developer for System z: EXEC CICS HANDLE ABEND statements give error CRRZJ0004E in Program Control Flow
PM92244 Rational Developer for System z: COBOL help is not available using LPEX Editor and COBOL Editor
PM92415 Rational Developer for System z: LPEX marks COPY keyword with '"TextNameliteral" expected after this token'
PM92457 Rational Developer for System z: The PL/I real time syntax check does not support the "dimacross" attribute
PM92481 Rational Developer for System z: Editors in RDz restricts the DEFAULT RANGE(ABC) to the exact name 'ABC'
PM92596 Rational Developer for System z: Assembler CLOSE macro produces "Incorrect Keyword" error during real-time syntax check
PM93415 Rational Developer for System z: WSDL2COBOL does not resolve XSD element references when multiple namespaces are present
PM93523 Rational Developer for System z: In CARMA, "Identify unreachable code" on COBOL fails with CRRZJ0005E
PM94142 Rational Developer for System z: LPEX command 'set fields' does not behave as expected
PM94154 Rational Developer for System z: Data Development Projects show up in zEnterprise View
PM94165 Rational Developer for System z: Ctrl+D to duplicate line in Basic LPEX editor scrolls vertically on local text file
PM94617 Rational Developer for System z: NullPointerException prevents context menu from opening or browsing SQLCA
PM94793 Rational Developer for System z: Unable to perform "ISPF functionality" on CARMA Endevor "non-standard"/numeric PDS member
PM94909 Rational Developer for System z: PL/I syntax check marks standard Logical NOT symbol ¬ in error
PM94980 Rational Developer for System z: Debug Tool does not display the correct content of memory using EBCDIC format
PM95090 Rational Developer for System z: CARMA Endevor 'Submit as batch job' UI option always defaults to 'Preview JCL'
PM95124 Rational Developer for System z: CICS statement doesn't support PL/I array access
PM95174 Rational Developer for System z: CARMA Endevor MOVE ELEMENT request does not return results
PM95363 Rational Developer for System z: Client side: permissions of the first logon user is retained for any subsequent user
PM95531 Rational Developer for System z: Contents of columns are erroneous in the CARMA Search view results
PM95558 Rational Developer for System z: Client experiences a NullPointerException with use of push to client
PM95859 Rational Developer for System z: In the RSE view, users sometimes cannot access MVS data sets
PM95995 Rational Developer for System z: PL/I program has empty outline view
PM96064 Rational Developer for System z: MVS subproject intermittently has files removed
PM96086 Rational Developer for System z: Compare ended with an exception
PM96277 Rational Developer for System z: The PL/I Editor Outline view may be wrongly empty in some specific conditions
PM96371 Rational Developer for System z: In the MFS Editor, the word ALPHA is wrongly not recognized as a keyword
PM96975 Rational Developer for System z: Unexpected realtime syntax check errors after preprocessor transformation
IC76777 Data Studio: Deploying a native stored procedure fails when "-- DISABLE DEBUG MODE" is present in the source code
IC94023 '£' character and other characters unable to display in Host Connect emulator with French host code page

Client - Fix Pack 3 (8.5.1.3)
Link Date Released Status
APAR Description
-- No APARs were resolved in this release.

Client - Fix Pack 2 (8.5.1.2)
Link Date Released Status
APAR Description
PM86210 Rational Developer for System z: Repository Instance not set when editing an element from the Search Results view

Host - Fix Pack 1 (8.5.1.1: UK92638 PTF)
Link Date Released Status
Host APARs Description
PM78800 Rational Developer for System z: Internal v8.5.1.1 defects/enhancements (NON-RSE): - FA integration is missing data for some of the events in the event summary - compatibility with z/OS UNIX APAR OA41101 - invalid SCLM Types returned in populate project request - when using the RDz CARMA Endevor RAM PRINT-MEMBER function, the dataset name is not copied into the JCL - when a Jobcard member is not found, an error is displayed when it should not since the jobcard is optional
PM78805 Rational Developer for System z: Internal v8.5.1.1 defects/enhancements (OPENRSE): - NPE if rsecomm.log cannot be created - data set lock not released when client ends - backup file causes problem when parent folder is read-only - multiple RDz RSE servers get *timeout* status, which is never reset
PM79619 Rational Developer for System z: When using the new CARMA Endevor "Quick Edit" feature on element, API0005E error is returned
PM80976 Rational Developer for System z: Internal v8.5.1.1 defects/enhancements (RSE): - missing quotes in sample CGI_ISPPREF definition - RDz client cannot connect to SSL server using client certificate. - expanding a filter containing 40,000 datasets on RDz client takes more than 3 minutes - there is not enough trace to show why a new threadpool server is started - multiple RDz RSE servers get *timeout* status, which is never reset - search fails with error owing to dynamic allocation failure - when doing a Remote Search on MVS filters, customer sometimes gets good results but sometimes the search hangs with message "Searching MVS Files : Waiting for server response". However, the Remote Search always works well when done directly on the PDS inside the MVS Filter - the "...xx more" command at the top list of an RSE-filter with at least 2 filter strings does not display all the members - when doing a Remote Search on PDS, customer has good response time and correct results for about the 2/3 first searches. Then, for the next searches (always on PDSs), the CPU is getting higher (till 70-80%) and results get wrong (hits number decreases significantly for initial hits about 5000-6000, but for initial hits about 20, results remain OK). - enhancement to remove usage of volume RESERVE
PM81660 Rational Developer for System z: CARMA user receives CRRZC0197E message when opening (browse/view) Endevor Element
Rational Developer for System z: RSE - Copying a PDS member provokes a Java NPE during Transfer Operation
PM84203 Rational Developer for System z: Quick Edit Endevor (batch mode) - Update source fails C1G0024E : The element was already present at xxxx
PM84786 Rational Developer for System z: Endevor search results do not return expected values when using the 'Enable "to" ' for environment and stage

Client - Fix Pack 1 (8.5.1.1)
Link Date Released Status
APAR Description
PM61570 Rational Developer for System z: utf-8 characters garbled on offline mode
PM71902 Rational Developer for System z: COBOL editor displays errors although compile works
PM73573 Rational Developer for System z: LPEX Editor does not display the correct x'15' and x'25' values
PM76442 Replace All, in the Search, will hang
PM76602 Content assist fails if a COBOL statement has string literals
PM76673 Rational Developer for System z: COBOL copybooks with $ in the name in EXEC SQL INCLUDE statements where the name is not in quotes are not resolved
PM77008 Rational Developer for System z: Outline View fails with Empty Stack Exception in PL/I Outline Parser
PM77621 Rational Developer for System z: Software Analyzer View - false positive on DCL BINARY FIXED() as opposed to DCL FIXED BINARY()
PM77950 Rational Developer for System z: Nested include files cause an error message when using the rename refactoring in PL/I
PM78177 Wrong Outline view tree when you use procedures without the procedure name on the end statement
PM78410 Rational Developer for System z: CARMA Endevor Container extract to local project disabled
PM78517 Rational Developer for System z: Realtime syntax check returns 'Misplaced construct' on valid PL/I EXEC CICS command/statement
PM78606 Unexpected cursor location after search and delete COBOL files in System z LPEX
PM78718 Technote: Include file error: "inter" formed from merged tokens on external CICS pre-processed include files with bin parameters
PM78766 Rational Developer for System z: Receive error CRIMC1037E when updating to Rational Developer for System z v8.5.1
PM78816 Rational Developer for System z: When debugging a PL/I file using custom OR or NOT or CONCATE operator, LPEX displays real-time syntax check
PM79480 LPEX editor including CHINESE CHARs generates extra space character
PM79669 Rational Developer for System z: A local preprocessor statement in a first line of a .pli file is shown by error in the outline view
PM80306 Rational Developer for System z: Fault Analyzer is missing data for some of the events in the event summary
PM80630 Rational Developer for System z: NullPointerException is raised when selecting a row on the Search view
PM80632 Member lost from z/OS project in Rational Developer for System z when using copy/paste/replace
PM80673 Rational Developer for System z : "Identify Unreachable Code" and "Program Control Flow" features show incorrect results
PM80755 Rational Developer for System z: Association between MVS subproject member/element to CARMA Endevor is lost
PM80768 Cannot disable automatic local help updater
PM80793 Rational Developer for System z: When debugging, hover fails in PL/I Editor
PM80876 Rational Developer for System z: Identify Preprocessor Statements action may not identify text inserted at end of program
PM80894 Rational Developer for System z: Enterprise Service Tools WSDL contains incorrect diacritic (Umlaut trema) characters when generated directly to the host
PM80898 Rational Developer for System z: New mapping file is not pulled in a new client workspace with Push To Client
PM80999 Rational Developer for System z: Software Analyzer hangs when analyzing a program with many copybooks
PM81025 Running a Show in > Program Control Flow results in NullPointerException
PM81135 Rational Developer for System z: When PL/I Editor used as Debug Editor, Double Click disabled for add/remove of breakpoint
PM81440 Rational Developer for System z: Program opened from Search view is displayed as text instead of COBOL
PM81539 Rational Developer for System z: StringIndexOutofBounds exception using Occurences in compilation unit with COBOL file
PM81555 Rational Developer for System z: When trying to edit an Endevor element from the search-result-list, user receives an error
PM81727 Rational Developer for System z: Debug perspective port listener icon missing
PM82676 Rational Developer for System z: CARMA null pointer exception at first element open
PM82688 Rational Developer for System z: Incorrect errors are raised on %do ..%end in PL/I program
PM83631 Nested array subscripts may not be reset during PL/I XML2LS conversion when parent array has different level arrays
PM83828 Rational Developer for System z: Software Analyzer "Analyze selected projects" should not contain internal projects like HostConnectProjectFiles
PM84524 Rational Developer for System z: Open MFS Element from CARMA Repositories view, Design and Preview tabs display "empty"

Host - Mod Pack 1 (8.5.1)
Link Date Released Status
Host APARs Description
PM66822 Rational Developer for System z: Internal v8.5.1.0 defects/enhancements (non-RSE):
  • Possible incorrect change code in properties table for selected member
  • Invalid error on missing environment variable displayed in SCLM operations log
  • When the client RSE connection, or the MVS subsystem is configured with a different code page than what is being used on the server, MVS member names may be misrepresented in the Remote Index search results, resulting in the inability to open the matching file from the Remote Index Search view. In addition, searches where users have defined mixed code pages for files that are indexed may fail to find matches, since the files will have been indexed using the code page that the Rational Developer for System z server is running with.
  • Error parsing closing tags in report.
  • Support for mapping XML elements and attributes of type xsd:boolean has been added to COBOL Compiled XML Conversion in the IMS COBOL top-down synchronous callout scenario
  • Rational Developer for System z users are not able to browse the CA Endevor elements to which they only have read-only access.
  • Rational Developer for System z users need reduced number of steps to locate and access the CA Endevor elements and to work with them.
  • Rational Developer for System z users need to customize jobs before they are submitted.
  • The label for the message that results from an action says "Error Message" even when the operation completed successfully. This can create confusion.
  • A logical record length of 80 is not sufficient to provide the information that are needed for some of the items.
  • When attempting to edit an element and saving it at a lower level that would cause jumping over another version of that element in the build map, the CA Endevor API provides a caution return code. The Endevor RAM interpreted the caution as an error, when it should not. When editing an element at a higher level environment and choosing as target a lower level environment, the changes made to the element are being saved at the entry stage of the higher level environment instead of at the entry stage of the lower level environment.
  • When attempting to edit an element and CARMA tries to get the memberid of the element at the new location, the stage name is missing from the memberid. This causes the RAM not to be able to correctly locate the element.
  • When editing an element and saving it in batch mode, if the temporary edit dataset name is too long, the SCL will contain a statement that goes past column 72 and thus result in the statement being truncated. This causes the Add Element to fail.
  • When searching for elements by CCID, the CCID fields of the search dialog are being ignored. This results in search results with other elements and not just the desired ones.
  • When retrieving elements by CCID in batch mode, in the generated SCL, the line containing the WHERE CCID clause has binary zeroes at the end of it. This causes errors in the execution of the JCL because the SCL is then considered invalid as a result of the binary zeroes being contained within it.
  • When creating a new Endevor element using the New -> Endevor Element function, the ability to specify the processor group is not provided in the "New Endevor Element" dialog. This is needed when a site does not allow default processor group when creating a new element. When creating a new Endevor element using the New -> Endevor Element function, the return dialog sometimes give an error stating that the number of expected return values is not what is expected.
  • When creating a new package using the New -> Endevor Package function, the target Stage Id dropdown in the "New Endevor Package View" dialog contains an error message instead of the list of stages. Continued in APAR PM77375
PM66834 Rational Developer for System z: Internal v8.5.1.0 defects/enhancements (RSE):
  • Remote search lines that are too long hover in the search results
  • Search result of load module doesn't show lines as the same strings
  • Cannot delete unexpired data sets
  • Abend when threadpool exceeds system max threads
  • Option to disable Remote Index Search menu item
PM67318 Rational Developer for System z: CARMA Endevor Element open causes Abend E37 on CRA$NDVR.DEPEND file
PM67928 Rational Developer for System z: Internal v8.5.1.0 defects/enhancements (OPENRSE):
  • Cancel search does not stop search on host
  • Server Finish processing takes a very long time
  • ServerUpdateHandler.removeSenderWith takes 30 minutes
PM69304 Rational Developer for System z: Environment variable _CMDSERV_BASE_HOME not set
PM70070 Rational Developer for System z: Internal v8.5.1.0 defects/enhancements (JMON): Hang when opening large JES output -m operator command/startup option
PM71360 Rational Developer for System z: An error occurred retrieving the SYSLIB information from SCLM for "member"
PM71977 Support for Extended Address Volume (EAV)
PM75387 Rational Developer for System z: IEC142I 113-38 error received when accessing IAM files
PM77375 Rational Developer for System z: Internal v8.5.1.0 defects/enhancements (non-RSE) continuation:
  • Enhancement to allow less stringent path specifications in CRASRV.properties
  • Enhancement to disable a RAM
  • Enhancement to add reformatted RSE logs to FEKLOGS
  • Lock daemon IVP does not do atomic writes like RSE when contacting the lock daemon
  • Serviceability enhancements
    • touch all Endevor RAM output DD's
    • report missing CRASTART loadmodule
    • FEKLOGS support for relative paths in CRASRV.properties and version specific checks
  • Enhancements to FEKLOGS: version specific checks, extra validation of USS paths
  • ABEND878 in FEKLOGS job
  • Enhancement that shows build dates of key components
  • Removing PsssTicket IVP from IVP=IVP startup
  • The AZUTSTRN stub error message only mentions sticky bit. This enhancement produces a correct error message when the related load module cannot be found
  • DD STDENV with rsed.envvars in started task JCL fails startup

  • Client - Mod Pack 1 (8.5.1)
    Link Date Released Status
    APAR Description
    PM06849 Rational Developer for System z: Content assist does not work if invoked for a line containing END
    PM51142 Rational Developer for System z: The API does not state which mode a file is opened in
    PM57385 Endevor package can be opened for update under Rational Developer for System z/CARMA and "native" Endevor at the same time
    PM66317 Rational Developer for System z: Error message CRRDG3112 is not documented in the information center
    PM67126 Rational Developer for System z: NOT SYMBOL in comments is modified
    PM68906 Rational Developer for System z: Running xsebatch program may result in PL/I converter files generated with incorrect line breaks
    PM69785 Rational Developer for System z: PLISAXC-based XML2LS converters cannot find root element when parsing Unicode XML
    PM70176 Missing export z/OS project action
    PM70671 Rational Developer for System z: Shortcuts for Locate, Retrieve Data Set and Retrieve Job are not available when the z/OS Projects view is not part of the perspective
    PM70797 Rational Developer for System z: In the v8.5 INFOCENTER, the zEnterprise Getting Started guide points to an 8.0.3 document
    PM70798 Rational Developer for System z: zEnterprise Getting Started PDF documentation, the supported server operating systems incorrectly includes JAVA
    PM71030 LPEX Editor Find/Replace only works for the first occurrence
    PM71193 Rational Developer for System z: COBOL and PLI-LS2XML conversion needs to escape CR
    PM72411 Rational Developer for System z: The security option "Validate Server name against server certificate subject." has been deprecated
    PM72615 Rational Developer for System z: Display of the "Program Control Flow Diagram" can lead to a CRRZJ004E error
    PM73479 Invalid binary search table is generated in PLI XML2LS converter for Unicode XML
    PM73581 Enable left and right ctrl keys in the host terminal emulator, works only for the current session
    PM73659 Rational Developer for System z: $savefilebefore and $saveandclosefilebefore Menu Manager commands do not work as expected
    PM73721 Nested array subscripts (ctx.X0000000) may not be reset during PL/I XML2LS conversion
    PM73722 IMS PL/I top-down converter encounters system AbendOC4 when IMS-MPP abends
    PM74123 Rational Developer for System zEnterprise: Files beginning with . are not displayed in Enterprise Explorer view
    PM74124 PL/I XML2LS conversion fails with message IRZ0966S while parsing base64Binary content
    PM74724 Rational Developer for System z: Following context menu refresh at the Endevor SCM RAM level, CARMA views get corrupted
    PM75823 Attempts to use Occurrences in compilation unit action for a PL/I declared structure results in StringIndexOutofBounds exception
    PM76461 Rational Developer for System z: The Real Time Syntax Check gives 'Ambiguous reference to variable-name'
    PM76465 Bad job card was created using SCLM Explorer View
    PM76787 Rational Developer for System z: Native stored procedures description names are modified to SQL - External with DB2 V10 Conversion Mode

    Fix Pack 1 (8.5.0.1)
    Link Date Released Status
    APAR Description
    PM69113 Rational Developer for System z: COBOL program flow diagram may be incomplete

    Initial Release (8.5)
    Link Date Released Status
    APAR Description
    PM03501 Rational Developer for System z LPEX editor does not honor margin when combined data length is greater than the margin
    PM26926 Rational Developer for System z: ACE errors when DBCS and sequence numbers are present
    PM03176 LPEX incorrectly makes the letters CICS red.
    PM10103 LPEX Editor displays syntax error for JCL
    PM16994 LPEX is not highlighting bad round trip characters
    PM26928 Sequence numbers are not detected correctly if source contains DBCS
    PM38179 LPEX highlighting not occurring with ROWSET and POSITIONING keywords
    PM39846 Data set in use error. COBOL or PL/I editor locks if invalid characters.
    PM41857 RS view doesn't display CRRZI0487E error when opening JCL/embedded source using SJ with non-roundtrippable chars
    PM43628 Display "DD *" input files without STEPNAME:DDNAME (" : ") in steps the don't execute.
    PM45787 JCL editor incorrectly shows an error if there is a symbolic in a PROCEDURE name
    PM46310 Rational Developer for System z LPEX editor displays error for an allocate with primary space of 0
    PM48693 FEKLOGS doesn't grab server logs
    PM49981 Extra double-quote generated before a label surrounded by double-quotes.
    PM50274 Local history is lost after copy/paste of a COBOL file in Rational Developer for System Z
    PM50744 Messages written only to SYSLOG and not to JOBLOG
    PM51370 Copybook type of an Endevor MOVE package is saved as 'copyook'
    PM52345 OR and NOT compiler option not working in property grp
    PM52427 Cannot login
    PM52710 Open Declaration is greyed out because OBJECT-COMPUTER and SOURCE-COMPUTER are reversed
    PM52981 Refresh (F5) doesn't work on local COBOL projects
    PM53144 The use of Content Assist with Sequential and PDS files takes too long
    PM53238 "ERROR_TOKEN" unexpected tokens ignored with editor
    PM53363 The result of multiple SQL script runs are not persistent in the Results view
    PM53397 No creation date given after a Copy/paste from Remote to Local
    PM53853 Structure comments not refreshed after edit
    PM53995 Editing a PLI file containing SELECT and LABEL might lead to incorrect warning "misplaced construct(s)"
    PM54317 When performing various CARMA/Endevor element functions, message at top of function dialogue panel indicates wrong element.
    PM54318 Host Connection Emulator loses focus when debugging. Function keys are impacted.
    PM54632 Rational Developer for System z PLI hover not working consistently
    PM54634 CEE3250C The system or user abend S878 R=00000010
    PM54684 EST Mapping Editor validation and/or Generate Conversion Code action may fail if mapping members of derived XSD complex type
    PM54747 Incorrect real-time check warning for PL/I variables declared using "like" instruction
    PM54809 Edit or browse of a SCLM member fails
    PM54940 Source / Format give wrong indentation
    PM55598 Editing a COBOL file with statement EVALUATE VAR1 > VAR2 results in an invalid real-time syntax check warning
    PM55603 Editing a PL/I file with statement call struc.myProc results in an invalid error "misplaced construct".
    PM55699 When creating a new Endevor package, selecting to copy SCL from existing package, resulting package is empty
    PM55735 Using Rational Developer for System z API, a IPhysicalFile is opened with the wrong editor.
    PM55779 Documentation states local help updater zip in incorrect location on product disks
    PM55955 CARMA Endevor comparison of file history doesn't show COBOL compare but Text compare
    PM56089 Extra end of line byte when copy / paste from RSE
    PM56114 Capitalization settings of Source > Format action using characters not supported in remote codepage
    PM56359 PLI Real Time Syntax check marks correct free parm in error
    PM56528 PL/I includes not resolved in LPEX Editor
    PM56559 Rational Developer for System z LPEX Editor displays syntax errors for JCL statements which run correctly when executed.
    PM57013 JMON does not handle a RC=4
    PM57018 Preprocessor variable/statement failing PL1 real-time check
    PM57187 When opening Endevor package in Rational Developer for System z that was created in native Endevor, PRINT SCL flagged in error.
    PM57542 Pushtoclient of a host-based project fails when a properties file is omited from subproject definition file
    PM57779 Endevor Stage number is sometimes not filled for Packages PRINT
    PM57950 Rational Developer for System z Endevor API is not hiding actions when programmed in plugin
    PM58316 Rational Developer for System z COBOL editor/LPEX editor report errors in CICS/IMS DLIUIB copybook
    PM58370 ASMA254I the LENGTH doesn't match PICOUT
    PM58681 Real-time syntax check indicates errors when ROWID is used as a COBOL data item
    PM58907 CARMA fails with FFFFFF abend when started on z/OS 1.13
    PM59074 Refresh of a dataset after an extract element from CA Endevor results in error CRRZI0221E Dynamic allocation failure.
    PM59268 Rational Developer for System z PLI editor displays COBOL column indicators in the ruler
    PM59321 Sorting of non-English characters in Remote Systems view is incorrect
    PM59733 COBOL syntax check of EXEC SQL INCLUDE .. END-EXEC terminating period rules inconsistent.
    PM59947 Copy to RAM at PDS Level shows successful even when no members copied
    PM59958 Retrieve multiple Endevor elements results in pop-up fields incorrectly filled in
    PM60205 Performance issue with COBOL editor when editing a COBOL file
    PM60608 FD FOOBAR LABEL RECORDS IS STANDARD. is not valid.

    Table of Contents:


    PTF UI37834 (9.0.1.5: UI37834)
    Link Date Released Status
    APAR Description
    PI61758 Abends in Rational Developer for System z CARMA when connecting to CA Endevor R17 and R18. CARMA CA Endevor integration failure on z/OS 2.2.
    9.0.x iFix 8 Java Platform Update
    Link Date Released Status
    APAR Description
    -- IBM Java Platform Standard Edition 7 Service Refresh 9 Fix Pack 40 -Multiple vulnerabilities in IBM Java SDK affects Rational Developer for System z (CVE-2016-0363 and CVE-2016-0376)

    9.0.1 Fix Pack 5 (9.0.1.5)
    Link Date Released Status
    APAR Description
    PI16221 LPEX editor jumps around after OpenDeclaration
    PI22547 Cursor is wrongly located after insertion of a line in LPEX
    PI38636 COBOL and LPEX editor does not flag a missing parenthesis as a syntax error
    PI38925 Opening a file associated with the LPEX-Editor can cause Eclipse to hang (hourglass)
    PI44264 FileNotFoundException: [filename].zip error occurs when program opened from PDS including copybook(s)
    PI45440 "Windows - No Disk" Exception is received from the Remote System view
    PI47152 Deletion of lines in LPEX editor may cause uncaught exception
    PI47608 Program ID between quotes violates the COBOL rule "Use a program name that matches the source file name"
    PI53832 COBOL rule of Specify 0 RECORDS for BLOCK CONTAINS clause is flagged as invalid by the Software Analyzer
    PI54857 LPEX block delete incorrectly removes trailing spaces when command line setting NUM COB is in effect
    PI55675 NUM COB command does not set the file as dirty
    PI56199 XML converter error IRZ0962S for web service having no element names
    PI56352 Code review should remove the width limit on generated HTML reports
    PTF UI37287 (9.0.1.5: UI37287)
    Link Date Released Status
    APAR Description
    PI31306 JES status incorrectly displays jobs as active when they are not
    PI47779 Rational Developer for System z Defects/Enhancements (RSE): Click on APAR link to view list of defects/enhancements
    PI53543 Rational Developer for System z Defects/Enhancements (non-RSE): Click on APAR link to view list of defects/enhancements
    PTF UI37242, UI37243, UI37244 and UI37245 (9.0.1.5: UI37242, UI37243, UI37244 and UI37245)
    Link Date Released Status
    APAR Description
    PI56006 Rational Developer for System z Utilities Internal Defects/Enhancements: Click on APAR link to view list of defects/enhancements
    PI56012 Rational Developer for System z Utilities Internal Defects/Enhancements: Click on APAR link to view list of defects/enhancements
    PI56033 Rational Developer for System z Utilities Internal Defects/Enhancements: Click on APAR link to view list of defects/enhancements
    PI56037 Rational Developer for System z Utilities Internal Defects/Enhancements: Click on APAR link to view list of defects/enhancements
    9.0.x iFix 7 Java Platform Update
    Link Date Released Status
    APAR Description
    -- IBM Java Platform Standard Edition 7 Service Refresh 9 Fix Pack 30 - Vulnerability in IBM Java SDK affects Rational Developer for System z (CVE-2015-7575)

    9.0.1.4 Interim Fix 3 (9.0.1.4_iFix003)
    Link Date Released Status
    APAR Description
    -- Vulnerabilities in GSKit affect Rational Developer for System z (CVE-2016-0201), (CVE-2015-7421), (CVE-2015-7420)
    9.0.x iFix 6 Java Platform Update
    Link Date Released Status
    APAR Description
    -- IBM Java Platform Standard Edition 7 Service Refresh 9 Fix Pack 20

    9.0.1.4 Interim Fix 2 (9.0.1.4_iFix002)
    Link Date Released Status
    APAR Description
    -- Open Source Apache Batik vulnerability affects Rational Developer for System z (CVE-2015-0250)
    9.0.x iFix 5 Java Platform Update
    Link Date Released Status
    APAR Description
    -- IBM Java Platform Standard Edition 7 Service Refresh 9 Fix Pack 20

    9.0.1.4 Interim Fix 1 (9.0.1.4_iFix001)
    Link Date Released Status
    APAR Description
    -- GSKit is an IBM component that is used by Rational Developer for System z. The GSKit that is shipped with Rational Developer for System z contains multiple security vulnerabilities including the “Malformed ECParameters causes infinite loop" vulnerability.
    9.0.1 Fix Pack 4 (9.0.1.4)
    Link Date Released Status
    APAR Description
    PI06575 SCLM DT Check-in option not showing up
    PI09668 Real time syntax error for copybook with COPY Replace syntax
    PI14187 If the variable inside a copybook with "REPLACING" has a numeric prefix, the COBOL parser flags it as invalid
    PI16867 Inconsistent context menu editor choices for COBOL sources in sequential data sets
    PI20306 COBOL program with several sections may end up with a 'Misplaced construct' error
    PI20790 After closing then reopening Perspectives, the LPEX parser fails to work
    PI21512 Server performance degradation when running on zPD&T
    PI22824 LPEX parser actions are disabled if COPY statements are placed before the Identification Division
    PI23904 LPEX editor block delete also removes trailing spaces
    PI23946 Error creating mapping for IMS SOAP Gateway with the target WSDL file extension in upper case
    PI24085 PL/I Entry declare messing up tooling
    PI24708 Hang when changing a variable in debug mode
    PI24745 When a concatenation with a temporary data set is used on SYSLIN in a RTC translator, user build generates incorrect JCL
    PI26408 Exception is received when accessing to the Local drive
    PI26582 PL/I source for VALUE function incorrectly flagged as syntax error
    PI27599 Host connection emulator is slower when not using p12 certificate
    PI28719 Long delay while adding a new data set name
    PI29597 PL/I built-in code review rule "Avoid Fixed Decimal declarations with even precision" does not work correctly
    PI29742 Expanding a zComponent project from the z/OS project explorer is slower than from the resource perspective
    PI30246 Error "BLOB expected instead of this input" when editing COBOL program with VARBINARY SQL type
    PI30988 PL/I rule Use INITIAL with STATIC data does not work correctly
    PI31000 CRRZI009E working offline and opening a copybook when the SYSLIB is defined with
    PI33531 RSE "Show in Table" quick search fails
    PI34297 COBOL rule INCLUDE SQLCA-mandatory in COBOL-DB2 source modules does not work correctly
    PI35632 Outline view loses the highlight when the cursor moves to a place in a hidden node
    PI36710 Open Member and Navigate to Data set menu items are not enabled consistently while editing JCL in LPEX editor
    PI37296 IMS Connect receives condition CEE3204S while running program CUNMUNI
    PI37772 When Deleting a data set in the z Remote Systems view, deletion of object fails
    PTF UI28242 (9.0.1.4: UI28242)
    Link Date Released Status
    APAR Description
    PI16815 CARMA Endevor - Periodically receive "CRRZC0301E The required RAMID is missing" using enhanced edit
    PI21387 zPD&T JMException or OperationFailedException Job has not finished executing
    PI23733 User can login using revoked certificate
    PI24983 Rational Developer for System z Defects/Enhancements (RSE): Click on APAR link to view list of defects/enhancements
    PI24984 Rational Developer for System z Defects/Enhancements (non-RSE): Click on APAR link to view list of defects/enhancements
    PI26088 Error feedback for assembler is CPU intensive
    PI26568 RSED processes flagged with *REJECTLOGON on operator console
    PI27295 CARMA Endevor 'Preview JCL' on batch action returns 'Job Submit error: Unable to access JCL Template on the host'
    PI27607 Editing an alias PDS member is allowed when the real PDS member is open in the ISPF editor
    PI28523 If SSL is enabled with the Java debug tracing, the RSE daemon does not start
    PI28620 Rational Developer for System z Defects/Enhancements (Open-RSE): Click on APAR link to view list of defects/enhancements
    PI28991 CICS Web service getting message IRZ9999S
    PI31089 User gets error "command C_HRECALL is not available"
    PI31408 Connect to host fails with ICH408I, invalid password, when it is lower case
    PI34491 PL/I compiler option OR('!') not accepted by Identify using configured preprocessors
    PI36425 RSEC1002 Invalid password or user ID on connection
    PI37404 ABEND878 observed for storage below the 16MB line
    PTF UI28166, UI28167, UI28168 and UI28169 (9.0.1.4: UI28166, UI28167, UI28168 and UI28169)
    Link Date Released Status
    APAR Description
    PI26084 Rational Developer for System z Utilities Internal Defects/Enhancements: Click on APAR link to view list of defects/enhancements
    PI41896 Rational Developer for System z Utilities Internal Defects/Enhancements: Click on APAR link to view list of defects/enhancements
    PI41905 Rational Developer for System z Utilities Internal Defects/Enhancements: Click on APAR link to view list of defects/enhancements
    PI41906 Rational Developer for System z Utilities Internal Defects/Enhancements: Click on APAR link to view list of defects/enhancements
    9.0.x iFix 4 Java Platform Update
    Link Date Released Status
    APAR Description
    -- IBM Java Platform Standard Edition 7 Service Refresh 9

    9.0.x iFix 3 Java Platform Update
    Link Date Released Status
    APAR Description
    -- IBM Java Platform Standard Edition 7 Service Refresh 8+IV70681

    9.0.1.3 Interim Fix 1 (9.0.1.3_iFix001)
    Link Date Released Status
    APAR Description
    -- GSKit is an IBM component that is used by Rational Developer for System z. The GSKit that is shipped with Rational Developer for System z contains multiple security vulnerabilities including the “FREAK: Factoring Attack on RSA-EXPORT keys" TLS/SSL client and server vulnerability.
    PTF UI24427 (9.0.1.3: UI24427)
    Link Date Released Status
    APAR Description
    PI21489 Rational Developer for System z Defects/Enhancements: Click on APAR link to view list of defects/enhancements
    PI27295 CARMA Endevor 'Preview JCL' on batch action returns "Job submit error: Unable to.."
    PI32193 Enhancement to the Rational Developer for System z Endevor Integration to provide the Systems Administrator with the ability to specify, when using the Packages Editor, what actions are allowed, and what parameters are allowed in the packages SCL for a particular action.

    9.0.x iFix 2 Java Platform Update
    Link Date Released Status
    APAR Description
    -- IBM Java Platform Standard Edition 7 Service Refresh 8+IV66375

    9.0.x iFix 1 Java Platform Update
    Link Date Released Status
    APAR Description
    -- IBM Java Platform Standard Edition 7 Service Refresh 7 Fix Pack 1

    9.0.1 Fix Pack 3 (9.0.1.3)
    Link Date Released Status
    APAR Description
    PI04715 COBOL Real Time Syntax checker treats CBL and Process keywords wrong
    PI04809 The SJ action on a JES-Monitor displays Hebrew characters in reversed meaning
    PI08767 Parser does not support split tokens in PL/I programs
    PI09678 DFHVALUE(OPEN) in COBOL source is not recognized by editor and flagged as warning
    PI10189 Enterprise Service Tools generates remote WSDL with incorrect diacritic characters
    PI10461 COBOL compare fails when comparing versions of same program
    PI10947 Nullpointer exception creating new Eclipse window from debug view
    PI11187 Error displayed in Real time syntax check for logical not (¬) symbol
    PI11287 LPEX editor's parser selection is case sensitive
    PI11552 PLI DCL statement with xmlattr/xmlomit attribute(s) not supported in the PL/I editor
    PI11664 CARMA Endevor Drag/Drop of Element into Package editor generates 'null' SCL entry
    PI11956 Message CRRZB0148E issued in BMS editor when protected field does not contain a space
    PI12640 System z LPEX Editor cannot edit COBOL program which contains Japanese chars.
    PI12732 USS z/FS and HFS file contents not saved after Menu >> File >> Restart
    PI12904 COBOL editor erroneously flagging CICS EXEC options: BACKLOG, MAXDATALEN, CLIENTADDR
    PI12955 In a PL/I generated PLI converter, the @dfs_soap_header is freed after a DFSXSETS
    PI13051 Paste action from the filter context menu does not copy the selected file
    PI13544 Enterprise Service Tools (EST) wrongly creates one-to-multiple mapping
    PI14099 3270 server certificate information for the Certificate Management Tool documentation is needed
    PI15266 CRRZI0022E error when user select Open JCL Procedure
    PI15959 PL/I code analysis may fail if includes are two or more levels deep
    PI16142 Run SQL option does not work for a COBOL source containing line numbers (cols 1-6)
    PI16576 CARMA Endevor 'Save and Generate' context menu item is disabled when 'Save' is enabled
    PI16720 Parsing Errors in PL/1 editor disables Editor Tool
    PI16748 Java 7 SR7 fixpack that includes JDK APAR IV48098
    PI17200 False error "SHARED RESOURCE IS NOT A IFILE" logged during ZLOAD from Rational Team Concert
    PI17381 ISO - Confusing message when Browsing/Opening unauthorized file
    PI17910 Navigating in the Compare Editor from a repository workspace, will show an error pop-up
    PI17929 Content Assist sometime fails using COBOL Editor
    PI18348 Meet in the middle generated PL/I code requires update to include LINKAGE (OPTLINK)
    PI18525 Client hangs when trying to connect to the host
    PI18893 %include in line 1 of a PLI-program causes errors in real time syntax check
    PI18944 When starting the client with a new workspace, the expected push-to-client preferences are not downloaded
    PI20204 Size in Properties view for large files shows 'Pending...' label or a wrong size.
    PI20215 Version 9 is slow to establish a host connection
    PI20225 %include in line 1 of a PL/I-program causes errors in real time syntax check
    PI20744 CARMA does not pre-load the processor group drop down list in the "ADD" element panel
    PI21195 Warning appears on PL/I comments after Software Analyzer runs on program from editor
    PI21210 NULLPOINTEREXCEPTION when trying any actions on SCLM views
    PI21355 Compare files with each other fails when files have single record format
    PI21439 Unable to load resource file workbench.xmi after restart
    PI21453 IMS Web service generated PL/I converter uses builtin function already declared as variable
    PI22548 Integrated debugger message "zOS probe was unable to locate the listing file....."
    PI22805 User build "LOCATE JOB" waits for completion of the job
    PI23332 Paragraph sign § in a property group additional JCL field translates to an invalid character
    PM74396 Bad column sorting - Data Source Explorer
    PTF UI20613 (9.0.1.3: UI20613)
    Link Date Released Status
    APAR Description
    PI11742 Rational Developer for System z Defects/Enhancements: Click on APAR link to view list of defects/enhancements
    PI11755 Rational Developer for System z Defects/Enhancements (non-RSE): Click on APAR link to view list of defects/enhancements
    PI11177 Rational Developer for System z internal defects: Click on APAR link to view list of defects/enhancements
    PI12111 FEKFIVPJ - Connect failed, rc= 2001
    PI12303 CRASUBCA fails with long argument string
    PI13547 Updating an USS File may result in an append instead of an update
    PI13951 Rational Developer for System z 8.5.1.4 client frequently disconnects from 9.0.1 host
    PI14555 FEKLOGS fail with completion code (CC) = 12
    PI14586 Client gets RSEG1056 and cannot connect to host on VIPA Backup LPAR
    PI15730 Opening an empty CARMA folder (no dataset member) results in return code of 4038
    PI18553 After upgrading to 9.0.1, VCMTEMP/SYSTSPRT files allocated with HLQ of RSED userid
    PI19223 Using top-down IMS web service for PL/I results in ICON CEEDUMP
    PI20489 Misleading message for login errors
    PI21560 Audit logs are not being deleted per retention parameter set in rsed.envvars
    PTF UI20747 and UI20748 (9.0.1.3: UI20747 and UI20748)
    Link Date Released Status
    APAR Description
    PI12759 Show abend code in program return code
    PI20623 Debug tool TCP/IP error
    PI23753 Rational Developer for System z Utilities Defects/Enhancements: Click on APAR link to view list of defects/enhancements
    PI23757 Rational Developer for System z Utilities Defects/Enhancements: Click on APAR link to view list of defects/enhancements
    9.0.1.2 Interim Fix 3 (9.0.1.2_iFix003)
    Link Date Released Status
    APAR Description
    -- IBM Java Platform Standard Edition Version 7 SR6 FP1 iFixes (IX90136+IX90137+IV39749)
    9.0.1.2 Interim Fix 2 (9.0.1.2_iFix002)
    Link Date Released Status
    APAR Description
    -- Rational Developer for System z is affected by a problem related to the SSL implementation which, under very specific conditions, can cause CPU utilization to rapidly increase.
    9.0.1.2 Interim Fix 1 (9.0.1.2_iFix001)
    Link Date Released Status
    APAR Description
    PI12894 Rational Developer for System z Attempts to install V9.0.1.2 fix pack results in error 'CRIMA1161E'
    PI12956 Rational Developer for System z Some labels are not translated into Italian
    9.0.1 Fix Pack 2 (9.0.1.2)
    Link Date Released Status
    APAR Description
    PI06189 Rational Developer for System z Slow performances opening files located on a network drive
    PI11455 Rational Developer for System z Unable to expand Local/Drive using the RSE view
    PTF UI14892 (9.0.1.1: UI14892)
    Link Date Released Status
    APAR Description
    PI09007 Rational Developer for System z Unable to connect to host using SSL enabled connection running 64-bit Java on z/OS
    PI09591 Rational Developer for System z Utilities Internal V9011 Defects/Enhancements: Click on APAR link to view list of defects/enhancements. Note: For the Integrated Debugger, the client and server must both be updated to the 9.0.1.1 fix pack level if either is updated.
    PTF UI14891 (9.0.1.1: UI14891)
    Link Date Released Status
    APAR Description
    PI09704 Rational Developer for System z Headless Code Review breaks on long output lines
    9.0.1 Fix Pack 1 (9.0.1.1)
    Link Date Released Status
    APAR Description
    PI08156 Rational Developer for System z MVS files subsystem Properties does not display the correct server level
    PI08878 Rational Developer for System z RTC 4.0.3 Load zfiles to z/os fails on subsequent submissions
    PM93830 Rational Developer for System z Local Help updater server not starting
    -- Rational Developer for System z Integrated Debugger - various fixes for Cobol V5 Debugging and CICS/Cobol Debugging Note: For the Integrated Debugger, the client and server must both be updated to the 9.0.1.1 fix pack level if either is updated.
    9.0 Interim Fix 2 (9.0_iFix002)
    Link Date Released Status
    APAR Description
    -- If you have Rational Developer for System z version 9.0 and Rational Application Developer version 9.0 installed in the same package and you want to update Rational Application Developer to version 9.0.1 without updating Rational Developer for System z, you will receive an error during the update process from Installation Manager.

    If you do not want to update Rational Developer for System z to version 9.0.1, then update Rational Developer for System z with interim fix 2 and you will be able to update Rational Application Developer to version 9.0.1.
    PTF UI13110 and UI13111 (9.0.1: UI13110 and UI13111)
    Link Date Released Status
    APAR Description
    PI06605 Rational Developer for System z Utilities Internal V9010 Defects/Enhancements: Updates are required to include new code review function
    PM93081 Rational Developer for System z Utilities Internal V9010 Defects/Enhancements: Click on APAR link to view list of defects/enhancements
    PTF UI13095 (9.0.1: UI13095)
    Link Date Released Status
    APAR Description
    PM91735 Rational Developer for System z Internal V9010 Defects/Enhancements (non-RSE): Click on APAR link to view list of defects/enhancements
    PM91978 Rational Developer for System z Internal V9010 Defects/Enhancements (RSE): Click on APAR link to view list of defects/enhancements
    PM94620 Rational Developer for System z Internal V9010 Defects/Enhancements (DSTORE): Click on APAR link to view list of defects/enhancements
    PM97232 Rational Developer for System z enhancement to add zPICL Integrated Debugger
    PM97233 Enhancement to embed the zPICL Integrated Debugger in Rational Developer for System z
    PM98010 Rational Developer for System z JMON FEKFIVPJ fails with RC 61
    PTF UI13093 (9.0.1: UI13093)
    Link Date Released Status
    APAR Description
    PM96864 Rational Developer for System z abends CEE3201S FFSException ABEND0C1 in libicuuc50 at routine ucnv_open_50
    Mod Pack 1 (9.0.1)
    Link Date Released Status
    APAR Description
    PI04710 Rational Developer for System z Webservice does not find copybooks in Importer/COBOL/SYSLIB
    PI05273 Rational Developer for System z Host Connect Emulator adds a new line to the end of pasted selection
    PI06829 Rational Developer for System z Push to Client Product Update fails to start the update on the Windows platform
    PM85091 Rational Developer for System z in the outline view of a PL/I source, the expand symbol is displayed with procedures that have no data while expanded
    PM92196 Rational Developer for System z Show In > Program Control Flow fails with "Unexpected internal error found: (ProgramControlFlowDriver.16)"
    PM93194 Rational Developer for System z when copy/paste done within HCE session, a '?' appears at the end of the "pasted" content
    PM93567 Rational Developer for System IMS Enterprise Suite SOAP Gateway service error due to missing end tag
    PM93830 Rational Developer for System z Local Help updater server not starting
    PM93919 Rational Developer for System z shows false warning when variable name is split by a continuation line
    PM94182 Rational Developer for System z the results for a search in CARMA do not display the type of elements
    PM94452 Rational Developer for System CARMA Endevor System and Subsystem names are being cleared in the Replace Element dialog
    PM95623 Rational Developer for System z Default Schema id in Data Access Development Support ignored
    PM95920 Rational Developer for System z JCL editor Open Declaration fails if reference contains national characters (@, #, $)
    PM95948 Rational Developer for System z cannot open PDS members or JES output on Windows 7 64-bit Hebrew
    PM96550 Rational Developer for System z CARMA Endevor ADD ELEMENT UI takes minutes to display after 'Add to Endevor' request
    PM97204 Rational Developer for System z Enterprise Service tools Mapping editor automatic group mapping incorrectly disabled
    PM97326 Rational Developer for System z Refresh SQL in Outline View may also display sequence numbers and comments
    PM99181 Rational Developer for System z invoking HATS RCP application from an editor for a remote file does not run properly when invoked from an open editor session for a remote file
    PM99208 Rational Developer for System z when using the code page '424 - Hebrew', the Key mapping for HCE does not work
    PM99209 Rational Developer for System z rename function ignores PL/I 'package exports' statement
    PM99323 Rational Developer for System z remote syntax check error message IBM2805I that includes apostrophe is not displayed
    PM99324 Rational Developer for System z remote syntax check error message is not displayed for an include file which has a $ in the member name
    PM99540 Rational Developer for System z timestamp in Software Analysis Results view is incorrectly formatted in some languages
    PM99736 Rational Developer for System z missing PL/I procedures in "package exports" statement are not flagged by the real-time syntax check
    9.0 Interim Fix 1 (9.0_iFix001)
    Link Date Released Status
    APAR Description
    PM92735 Rational Developer for System z LPEX syntax highlighting lost for a.o. Rexx and Fortran
    Initial Release (9.0)
    Link Date Released Status
    APAR Description
    PM61570 Rational Developer for System z UTF-8 characters garbled on offline mode
    PM64245 ISPF number sequence update rules on host and client are not the same
    PM66535 LPEX invisible line with long record RECFM=VB
    PM66887 Rational Developer for System z content assist does not work with PL/I 'LIKE' keyword in a declaration
    PM67780 Rational Developer for System z auto completion for PL/1 "structures" keyword provides no hints
    PM67867 Rational Developer for System z content assist for PL/I Handles with a '=>' operator does not display all the members
    PM69320 Rational Developer for System z LRECL of sequential data set incorrect in editor after deletion and recreation with new LRECL outside RDz
    PM70372 Rational Developer for System z operator not displaying help content for += operators
    PM71098 Rational Developer for System z loop in auto-completion that provokes RDz client OOM
    PM71902 Rational Developer for System z COBOL editor displays errors although compile works
    PM72491 Rational Developer for System z CARMA Endevor Systems name field not refreshed in pulldown of Add element
    PM72750 LPEX editor gives "Ambiguous reference to variable-name"
    PM73131 Rational Developer for System z PL/I Remote Syntax Check marks incorrectly located when using diacritic characters like the German umlaut
    PM73573 Rational Developer for System z LPEX Editor does not display the correct x'15' and x'25' values
    PM74994 PURGE multiple jobs stops on failure or timeout
    PM75292 Syntax checker does not tolerate a missing END PACKAGE statement while compiler does
    PM75295 Syntax checker flags as error valid statement FETCH entry-constant TITLE (qualified-name)
    PM75996 Rational Developer for System z logon attempt fails with EDC5140I Broken pipe
    PM76442 Replace All, in the Search, will hang
    PM76602 Content assist fails if a COBOL statement has string literals
    PM76673 Rational Developer for System z COBOL copybooks with $ in the name in EXEC SQL INCLUDE statements where the name is not in quotes are not resolved
    PM76914 Rational Developer for System z EST-XSE wizard can be made to generate an invalid XMLSS-based converter for COBOL 3.4
    PM77008 Rational Developer for System z Outline view fails with Empty Stack Exception in PL/I Outline Parser
    PM77104 NOHANDLE option is not accepted before the end of a 2 word commands in CICS EXEC statements
    PM77542 Renaming an RSE connection doesn't automatically rename its associated CARMA connection
    PM77621 Rational Developer for System z Software Analyzer View - false positive on DCL BINARY FIXED() as opposed to DCL FIXED BINARY()
    PM77950 Rational Developer for System z nested include files cause an error message when using the rename refactoring in PL/I
    PM77951 Rational Developer for System z PL/I Editor: use the Compiler Directive syntax style for %INCLUDE statements
    PM78177 Wrong Outline view tree when you use procedures without the procedure name on the end statement
    PM78410 Rational Developer for System z CARMA Endevor Container extract to local project disabled
    PM78464 Running a Show in > Program Control Flow results in NullPointerException
    PM78509 Rational Developer for System z real time syntax check for COBOL flags include starting in column 7
    PM78517 Rational Developer for System z real time syntax check returns 'Misplaced construct' on valid PL/I EXEC CICS command/statement
    PM78606 Unexpected cursor location after search and delete COBOL files in System z LPEX
    PM78816 When debugging a PL/I file using custom OR or NOT or CONCATE operator, LPEX displays real-time syntax check errors
    PM79480 LPEX editor including CHINESE CHARs generates extra space character
    PM79669 Rational Developer for System z local preprocessor statement in a first line of a .pli file is shown by error in the Outline view
    PM80630 Rational Developer for System z NullPointerException is raised when selecting a row on the Search view
    PM80632 Member lost from z/OS project in Rational Developer for System z when using copy/paste/replace
    PM80673 Rational Developer for System z "Identify Unreachable Code" and "Program Control Flow" features show incorrect results
    PM80750 Rational Developer for System z CARMA Endevor ADD Element request does not include Processor Group Name
    PM80755 Rational Developer for System z association between MVS subproject member/element to CARMA Endevor is lost
    PM80793 Rational Developer for System z when debugging, hover fails in PL/I Editor
    PM80840 Rational Developer for System z lock not released on host after client ended from task manager
    PM80876 Rational Developer for System z Identify Preprocessor Statements action may not identify text inserted at end of program
    PM80894 Rational Developer for System z Enterprise Service Tools WSDL contains incorrect diacritic (Umlaut trema) characters when generated directly to the host
    PM80898 Rational Developer for System z new mapping file is not pulled in a new client workspace with Push To Client
    PM80999 Rational Developer for System z Software Analyzer hangs when analyzing a program with many copybooks
    PM81025 Running a Show in > Program Control Flow results in NullPointerException
    PM81113 Rational Developer for System z CRRZI0277E System ABEND 213-30
    PM81120 Rational Developer for System z Remote Search on MVS filters leads to a "waiting for server response" message
    PM81135 Rational Developer for System z when PL/I Editor used as Debug Editor, Double Click disabled for add/remove of breakpoint
    PM81346 Rational Developer for System z Code Review / Software Analysis should not display avoid warning for dynamic call statement
    PM81440 Program opened from Search view is displayed as text instead of COBOL
    PM81539 Rational Developer for System z StringIndexOutofBounds exception using Occurences in compilation unit with COBOL file
    PM81727 Rational Developer for System z Debug perspective port listener icon missing
    PM81735 Rational Developer for System z HATS RCP application fails with HPS5142
    PM82192 Rational Developer for System z RSE Copying a PDS member provokes a Java NPE during Transfer Operation
    PM82676 Rational Developer for System z CARMA null pointer exception at first element open
    PM82688 Rational Developer for System z incorrect errors are raised on %do ..%end in PL/I program
    PM82980 Rational Developer for System z incorrect Content Assist error when a diacritic chr (èú..) is in the sequence number (col 73-80)
    PM83341 Rational Developer for System z RSE filter with more than one filter string does not display all members
    PM83631 Nested array subscripts may not be reset during PL/I XML2LS conversion when parent array has different level arrays
    PM83828 Rational Developer for System z Software Analyzer "Analyze selected projects" should not contain internal projects like HostConnectProjectFiles
    PM83984 Opening a filter containing 40,000 data sets takes more than 3 minutes
    PM84127 Rational Developer for System z running Remote Search on PDS returns an incorrect result list
    PM84203 Rational Developer for System z Quick Edit Endevor (batch mode) - Update source fails C1G0024E : The element was already present at xxxx
    PM84266 Reserved words AS or ATTRIBUTES are not reserved
    PM84334 Rational Developer for System z Code Coverage Report misses some references to launch history
    PM84524 Rational Developer for System z open MFS Element from CARMA Repositories view, Design and Preview tabs display "empty"
    PM84568 Rational Developer for System z Program Control Flow gives CRRZJ0004E on SEARCH statement
    PM84786 Rational Developer for System z Endevor search results do not return expected values when using the 'Enable "to" for environment and stage
    PM85803 Rational Developer for System z receives timeout errors with opening PDS data sets
    PM85884 Rational Developer for System z COBOL parser shows an unexpected error for the exponentiation operator ("**") when followed by a unary negative expression
    PM86061 Rational Developer for System z COBOL Editors, Remote pre-processor inserts double SQLCA
    PM86066 Rational Developer for System z LPEX editor wrongly shows tip-presentation of variable values
    PM86150 Rational Developer for System z Scandic characters are not correctly displayed when creating new element in Endevor
    PM86210 Rational Developer for System z Repository Instance not set when editing an element from the Search Results view
    PM86888 Rational Developer for System z C developers may encounter error "UnsupportedEncodingException: filetag"
    PM86890 Rational Developer for System z PL/I Real Time Syntax Check does not accept the '<>' sequence (not equal)
    PM87606 Rational Developer for System z bad restitution of some characters shown in include files via hover (PL/I source)
    PM87776 Rational Developer for System z search consumes too much CPU
    PM87885 Rational Developer for System z message "TPFC7005I" when RDz starts in a workspace on a UNC-naming shared drive
    PM89085 Rational Developer for System z submit fails when total length of PDS(member) > 44 characters

    Table of Contents:


    9.1.1.3: Host Options UI37833 PTF
    Link Date Released Status
    APAR Description
    PI59020 Abends in Rational Developer for System z CARMA when connecting to CA Endevor R17 and R18

    9.1.x iFix 8 Java Platform Update
    Link Date Released Status
    APAR Description
    -- IBM Java Platform Standard Edition 7 Service Refresh 9 Fix Pack 40 - Multiple vulnerabilities in IBM Java SDK affects Rational Developer for System z (CVE-2016-0363 and CVE-2016-0376)

    Interim Fix 1 (9.1.1.3_iFix001)
    Link Date Released Status
    APAR Description
    PI58260 Fixes for BIDI support from Data Studio
    9.1.1.3: Host Options UI37230 PTF
    Link Date Released Status
    APAR Description
    PI59019 CARMA CA Endevor integration failure on z/OS 2.2

    Fix Pack 3 - Client
    Link Date Released Status
    APAR Description
    PI39598 Program Control Flow diagram cannot be generated from debug view
    PI41124 Opening a large PL/I file will result in a hang during the real-time syntax check
    PI41675 Attempts to generate JCL for Compile Link result in java.lang.NumberFormatException
    PI45977 Files copied by User builds are loaded to MVS in Host Emulation with the wrong code page
    PI47187 Opening or compiling a COBOL source with System z LPEX editor results in error
    PI47869 Fail to start with NPE
    PI49681 Refactor > Rename may cause an internal error in the COBOL syntax parser
    PI49690 Annotation error in EXEC SQL CASE WHEN statements
    PI50268 COBOL program containing copybook with SKIP1 prior to FD definition gives parser error
    PI50683 Data set member is locked after it is edited with SQL XQuery editor
    PI50778 Real-time syntax check gives incorrect warning "use binary subscripts"
    PI50854 Show expanded source may result file does not exist error
    PI50870 Editors do not parse the CICS GETMAIN syntax
    PI51077 Stepping may not work correctly for a COBOL program that has been compiled with ARCH(8) option or higher
    PI51212 Cursor jumps to first line while typing in the toggle block mode with the Manage sequence numbers preference enabled
    PI51378 PL/I real-time syntax check raises incorrect error on SELECT CASE statement
    PI51443 Opening Rational Developer for System z with connection to Rational Team Concert checks out a Rational Software Architect license
    PI51569 Unexpected ICH408I INSUFFICIENT ACCESS AUTHORITY FROM SYS1.*.** (G) for SYS1.PROCLIB
    PI51847 Deactivate statement without % prefix will result in incorrect behavior in the PL/I parser
    PI52107 Debugger Editor loses blank on repeated search
    PI52403 Performance problem when using RTC load files to z/OS
    PI52713 NullPointerException during "Create Baseline" in Software Analysis
    PI52761 Message ID AQECM116E should not end with E
    PI52782 Debugging a non-LE program may result in an empty debug editor
    PI52783 Software Analyzer for a PL/I program with nested includes has poor performance
    PI52785 PL/I program with nested includes shows toolbox with red X
    PI52788 Software Analyzer for PL/I programs is slow
    PI52890 COBOL real-time syntax check raises invalid error for REPLACE statement with lines having D in column 7
    PI54171 Rational Team Concert views not properly refreshed with Rational Developer for System z default theme
    PI54213 Push to client is not installing updates if property files contain trailing blanks
    PI54356 Save member fails with message "The lock for file {0} could not be reacquired"
    PI54498 Real-time syntax check raises invalid error for VALUE clause with quotes on continuation line
    PI55443 z/OS project view displays empty window
    PI56023 Rational Developer for System z and Rational Team Concert integration fails to load a z/OS file which has been migrated
    PI56131 Error when refreshing a z/OS project
    PI56710 Real-time syntax check incorrectly shows: space is invalid

    9.1.1.3: Host Options UI35670 PTF
    Link Date Released Status
    APAR Description
    PI44420 Integrated Debugger is not able find CICS transaction side files when moved from original place
    PI49859 Modify Command for RSE Daemon gives incorrect output in FEK201i message
    PI50532 Error INSUFFICIENT AUTHORITY on /u/user/eclipse/RSE/USER after auto mount
    PI51265 USS-related abendA03 in a spawned BPXAS RDz ASID at irregular intervals
    PI51595 After a load to z/OS, files are displayed as "Unresolved"
    PI52435 Rational Developer for System z V9113 Internal Defects and Enhancements - NONRSE: Click on APAR link to view list of defects and enhancements
    PI52436 Rational Developer for System z enhancement- Access multiple SCM instances from 1 connection. Rational Developer for System z client fix pack version 9.1.1.3 is required for this APAR.
    PI53498 All threadpools got frozen after migrating to Rational Developer for System z fixpack version 9112 and Java 8
    PI54451 Abend 0C4 in CA module BSTPLLST during CARMA Endevor RAM processing
    PI54590 Host configuration utility script generates truncagted rsed.envvars

    9.1.1.3: Host Utilities UI35708, UI35709, UI35710 and UI35711 PTFs
    Link Date Released Status
    APAR Description
    PI56096

    Rational Developer for System z Utilities 9.1.1.3 Defects and Enhancements: Click on APAR link to view list of defects and enhancements
    PI56098
    PI56099
    PI56104

    9.1.x iFix 7 Java Platform Update
    Link Date Released Status
    APAR Description
    -- IBM Java Platform Standard Edition 7 Service Refresh 9 Fix Pack 30 - Vulnerability in IBM Java SDK affects Rational Developer for System z (CVE-2015-7575)

    Interim Fix 2 (9.1.1.2_iFix002)
    Link Date Released Status
    APAR Description
    -- Vulnerabilities in GSKit affect Rational Developer for System z (CVE-2016-0201), (CVE-2015-7421), (CVE-2015-7420)
    9.1.x iFix 6 Java Platform Update
    Link Date Released Status
    APAR Description
    -- IBM Java Platform Standard Edition 7 Service Refresh 9 Fix Pack 20

    Interim Fix 1 (9.1.1.2_iFix001)
    Link Date Released Status
    APAR Description
    -- Open Source Apache Commons Collections vulnerability affects Rational Developer for System z (CVE-2015-7450)
    Fix Pack 2 - Client
    Link Date Released Status
    APAR Description
    PI28726 Content assist for a PL/I source in a local project may not work correctly
    PI37224 Attempts to use section symbol as variable in copy/replace results in multiple errors
    PI37425 DB2 Program(PP(SQL) Compiler Option) receives unresolved SQLCA variables
    PI37429 When opening COBOL element using CARMA Endevor enhanced edit, wrong copybook version is resolved
    PI37515 Software Analyzer does not support 'Abbreviated Combined Relation Conditions' in COBOL
    PI37948 LPEX and COBOL editor "Show in" >> "Program Control Flow" results in CRRZJ0004E ClassCastException
    PI38038 Copybooks with names containing #@$ on -INC statement are not found by the COBOL editor
    PI38257 Data Editor not properly handling the x'0E' and x'0F' characters
    PI38326 User build changes x'15 characters to x'25
    PI38404 RTC integration transfers files as binary during drag and drop from local to a partitioned data set
    PI38848 Attempts to debug a CICS transaction results in a pop-up when the CICS transaction ends
    PI39034 COBOL show expanded source not working for source in a sequential data set
    PI39233 PL/I and LPEX editor shows multiple erroneous problem markers when there is a space within PIC specifications
    PI39443 Block comments limitation in SYSPUNCH files
    PI39800 A warning is shown when parsing a CICS statement if it is coded inside a copybook
    PI40047 Real-time syntax check gives an incorrect error ";" expected instead of this input
    PI40228 Client - TSO shell translation of < and > is incorrect
    PI40466 PL/I real-time syntax check has problem when BEGIN END block sits inside a DO END
    PI40674 Opening a local file results in error with no contents displayed in editor
    PI41007 Warning icons from Software Analyzer no longer appear in editor
    PI41267 RTC 5.0 content assist wrongly changes the line delimiter of a COBOL file
    PI41344 COBOL editor "Create Paragraph" quick fix fails with a stackoverflow error
    PI41553 New editor function does not update the PL/I program source correctly
    PI41622 Data Editor does not indicate when file format is not supported
    PI41628 Save action "Identify Unreachable Code" fails when invoked after modifying/saving a COBOL source
    PI41644 "OSGI Bundle Project Reference" to a CICS bundle results in an unhandled event loop exception
    PI41901 DO block in an IF/ELSE statement is not highlighted
    PI41911 dbx command results in NullPointerException when debugging C++ program
    PI41982 Expanding or deleting a z/OS project containing 400+ subprojects is slow
    PI42055 Running Software Analysis for PL/I programs may result in stackoverflow error
    PI42317 An include file within a PL/I source is not found by the local preprocessor if the source is not part of a remote project
    PI42414 Compare feature fails when source has nested COBOL programs
    PI42463 If service specification xml contains more than one operation and/or a router specification, validation error will occur when running the command line (CLI) batch processor xsebatch
    PI42680 Client may freeze and crash when content assist is invoked
    PI42723 Erroneous error markers appear in RDz realtime syntax checker when declaring 'PIC' as a variable name
    PI43239 PL/I parser does not work if an array element is used in embedded language statements
    PI43517 PL/I editor throws warning for Danish character in a EXEC CICS statement
    PI43810 Warning shown when parsing a CICS statement if it is coded inside a copybook
    PI44276 Enter key does not work with "Jump To" in Data Editor
    PI44550 Duplicate breakpoints created when double clicking to remove existing breakpoints via the editor ruler
    PI45077 Real-time syntax check error in COBOL REPLACE statement with comments
    PI45121 Special German characters are not displayed correctly after re-submitting the JCL from its JES job
    PI46456 User's drag and drop file in z/OS project view generates preference file
    PI47112 CARMA Endevor copybooks are not found when using Enhanced editor with property group
    PI47339 Copybook for Web services generated with English comments instead of German
    PI47612 Error Resource '/test PLI/-1031650450/HelloApp.PLI' does not exist during "Show expanded source"
    PI47656 The character £ is not recognized by the JCL editor
    PI48814 Export of remote search results creates incorrect output file
    PI48850 Unexpected error "endp expected instead of this input" during real-time syntax check of a PL/I program
    PI49674 Cannot browse load modules with extension exe

    9.1.1.2: Host Options UI32110 PTF
    Link Date Released Status
    APAR Description
    PI22457 Integrated Debugger fails to display source when compile listing sysprint is a sequential data set
    PI38133 Rational Developer for System z V9112 Internal Defects and Enhancements - RSE: Click on APAR link to view list of defects and enhancements
    PI38640 Abend 213-30 results when saving a member of a partitioned data set
    PI40238 Host - TSO shell translation of < and > is incorrect
    PI41068 Rational Developer for System Z V9112 Internal Defects and Enhancements - NONRSE: Click on APAR link to view list of defects and enhancements
    PI41154 CA TOPSECRET/ACF2 users unable to allocate data sets
    PI41904 ABENDS878-10 in LSQA below 16MB filled with RACF ACEE and ACEX control blocks
    PI46139 Integrated Debugger fails with abend 0C4 in sendModuleLoad with DB2 source code
    PI46385 Client IP address missing in GSK_SECURE_SOCKET_INIT() FAILED: CERTIFICATE IS NOT VALID
    PI46511 Remote z/OS search may cause threadpool to timeout if MAXTHREAD reached
    PI47510 Integrated Debugger does not step into PL/I Call statements
    PI47760 Rational Developer for System z V9112 Internal Defects and Enhancements - ID: Click on APAR link to view list of defects and enhancements
    PI48501 feklog issues warning for /tmp when not used as TMPDIR value in rsed.envvars
    PI48852 Remote file search with lowest frequency setting may cause a high CPU on the host
    PI49872 Attempts to save large program opened using CARMA Enhanced Editor result in abend 0C4

    9.1.1.2: Host Utilities UI32127, UI32128, UI32129 and UI32130 PTFs
    Link Date Released Status
    APAR Description
    PI41042

    Rational Developer for System z Utilities 9.1.1.2 Defects and Enhancements: Click on APAR link to view list of defects and enhancements
    PI50521
    PI50523
    PI50524

    Interim Fix 2 (9.1.1.1_iFix002)
    Link Date Released Status
    APAR Description
    -- Open Source Apache Batik vulnerability affects Rational Developer for System z (CVE-2015-0250)
    9.1.x iFix 5 Java Platform Update
    Link Date Released Status
    APAR Description
    -- IBM Java Platform Standard Edition 7 Service Refresh 9 Fix Pack 1

    Interim Fix 1 (9.1.1.1_iFix001)
    Link Date Released Status
    APAR Description
    -- GSKit is an IBM component that is used by Rational Developer for System z. The GSKit that is shipped with Rational Developer for System z contains multiple security vulnerabilities including the “Malformed ECParameters causes infinite loop" vulnerability.
    9.1.x iFix 4 Java Platform Update
    Link Date Released Status
    APAR Description
    -- IBM Java Platform Standard Edition 7 Service Refresh 9

    9.1.x iFix 3 Java Platform Update
    Link Date Released Status
    APAR Description
    -- IBM Java Platform Standard Edition 7 Service Refresh 8+IV70681

    Fix Pack 1 - Client
    Link Date Released Status
    APAR Description
    PI26482 EXEC SQL statement in PL/I source results in ambiguous reference
    PI26958 Run SQL not working for DECLARE CURSOR
    PI27551 False warning shown when CICS LINK is split by continuation line
    PI29968 Real time syntax check issues warning in PL/I with REORDER in PROC and INIT construct
    PI30346 GDG Member list incorrect in RSE view with SPIRIT=TRUE
    PI30353 Identify using configured preprocessors fails for PL/I sequential data sets
    PI30741 ISPF editor profile sets tabs to column 1 and does not allow it to be changed
    PI30904 zUnit cannot handle INCLUDE SQLCA statement properly
    PI31906 Parm statement missing when using generate JCL
    PI31997 Slow performance when entering BMS mapset name
    PI32083 Compare with editor for JES incorrectly displays some international characters
    PI32393 Program Control Flow view search does not update diagram highlighting if search fails
    PI32468 'Host Characters Replacement' LPEX Editor preference ineffective for 0xFF value
    PI32794 MFS editor does not give option to Save even when file has changed
    PI32862 Design tab of MFS Editor missing when the source contains a literal string 'G'
    PI32863 MFS editor flags 'DO' statements erroneously if the line-increment is missing
    PI32864 Keybinding does not work for two-chord shortcuts (e.g. Ctrl+Shift+P, right_arrow)
    PI33181 Workbench hangs on closing when an MFS editor is opened with errors
    PI33271 RTC Integration 4.06 - Load of a large workspace is 5X slower than with 4.03 integration
    PI33389 PL/I include files with multiple procs may display errors for the end statements
    PI33420 Client screen turns black briefly when moving views
    PI33519 User build generates JCL with DISP=MOD regardless of what is configured in RTC translator
    PI33534 Jobs with Notify that are purged via JMON are not removed from notify queue
    PI33716 "No schema found" shown when adding extension point to the plug-in
    PI33768 Debug GUI for Assembler receives internal error when monitoring storage in EBCDIC
    PI33806 RSE 'Monitor' function does not "refresh" ACTIVE JES job statistics on poll intervals
    PI33855 Editor cannot find copybooks referenced by a -INC statement before column 7
    PI34119 Long delay while adding a new data set name in System Managed Storage dialog
    PI34237 Message CRRZT0044E when generating zUnit test case
    PI34349 User build submit generated JCL progress window fails to close
    PI34374 User build fails for files imported to RTC as binary
    PI34539 PL/I Real-time Syntax check tooling stays in "Initializing" step
    PI35355 zUnit "Generate Test Program" wizard fails to replace the index data itemzUnit "Generate Test Program" wizard fails to replace the index data item
    PI35638 User build generates JCL with DISP=NEW for a temporary DS created in a previous step
    PI36192 LPEX and COBOL editor show incorrect indentation when editing source that contains x'15', the EBCDIC(NL) control character
    PI36396 com.ibm.systemz.pl1.editor.core.ftt trace ID missing from the tracing preferences

    9.1.1.1: Host Options UI26082 PTF
    Link Date Released Status
    APAR Description
    PI29603 Endevor ADD ELEMENT request does not include update when 'UPDATE IF PRESENT' selected
    PI29863 Results of two commands executed in the same TSO gateway session, can be exchanged
    PI30716 Long MVS filter name results in an empty list
    PI31436 Rational Developer for System Z V9111 Internal Defects and Enhancements - NONRSE: Click on APAR link to view list of defects and enhancements
    PI31444 Rational Developer for System z V9111 Internal Defects and Enhancements - OPENRSE: Click on APAR link to view list of defects and enhancements
    PI32199 Enhancement to grey-out some options from the client drop-down list in CARMA package editor
    PI32356 TSO shell incorrectly translates "& lt;" and "& gt;" strings to "<" and ">"
    PI33534 CARMA Endevor - receive "CRRZC0301E The required RAMID is missing" using enhanced edit
    PI33808 Failed to connect to server due to 'password revoked' or loop in RACF API call
    PI34291 Rational Developer for System z V9111 Internal Defects and Enhancements - ID: Click on APAR link to view list of defects and enhancements
    PI34783 Creating host data sets fail when using codepage IBM-1141 and "§" (paragraph) in the data set name
    PI35468 Java heap usage grows until disconnect when copybooks are not found

    9.1.1.1: Host Utilities UI27246, UI27249, UI27250 and UI27251 PTFs
    Link Date Released Status
    APAR Description
    PI31454

    Rational Developer for System z Utilities 9.1.1.1 Defects and Enhancements: Click on APAR link to view list of defects and enhancements
    PI36761
    PI36767
    PI36778

    Interim Fix 1 (9.1.1_iFix002)
    Link Date Released Status
    APAR Description
    -- GSKit is an IBM component that is used by Rational Developer for System z. The GSKit that is shipped with Rational Developer for System z contains multiple security vulnerabilities including the “FREAK: Factoring Attack on RSA-EXPORT keys" TLS/SSL client and server vulnerability.
    Interim Fix 1 (9.1.1_iFix001)
    Link Date Released Status
    APAR Description
    -- Enhancement to the Rational Developer for System z Endevor Integration to provide the Systems Administrator with the ability to specify, when using the Packages Editor, what actions are allowed, and what parameters are allowed in the packages SCL for a particular action.

    Mod Release 1 (9.1.1)
    Link Date Released Status
    APAR Description
    PI05585 LPEX editor Cut/Paste problem - COBOL full line only pasting prefix area part
    PI14626 DISPLAY environment variable needs to be set for headless code coverage
    PI15887 ZLINUX cannot access files
    PI16287 Failure to import custom rules set
    PI17257 Some CARMA Endevor Package properties are not populated in the Properties view for a selected package
    PI18873 PUSHTOCLIENT exporting wrong version of system mapping file ZOSSYS.XML
    PI19113 Menu manager variable $FULLNAME is evaluated incorrectly
    PI19722 Use of host variable in EXEC SQL SELECT INTO statement results in an ambiguous reference warning
    PI20849 Program Control Flow fails for PL/I program without procedure name in the END label
    PI20895 CARMA Endevor Packages RAM 'View CAST Report' does not open report
    PI20952 PL/I Outline view is incorrect within PUT statement which contains DO Clause
    PI22028 False "ambiguous reference" warning in PL/I editor for labels with same name as variables
    PI22679 Outline view may not correctly reflect the cursor location in PL/I source
    PI23360 SYSXMLSD DD parameters not provided to allocate a data set
    PI23797 Adding extra blank lines when submitting JCL to internal reader
    PI23866 Integrated debugger does not show source when using SYSIN for options
    PI23917 Generating Program Control Flow leads to a CRRZJ0004E error message
    PI24795 'Paste' is disabled on 'My Data Sets' filter after "Copy' is performed
    PI26320 Content Assist functionality doesn't work as expected for Hebrew codepage
    PI26416 Code coverage may not provide coverage for all requested files
    PI26466 Rational Developer for System z (RDz) 9.1 and Data studio 4.1.1 cannot be installed in the same package group
    PI26521 RED and IRRED attributes are not accepted by PL/I real time syntax check
    PI26565 Menu Manager actions not being executed through JCL editor sub-menus
    PI27084 Software analyzer for PL/I - Avoid implicit declaration rule flags common CICS calls
    PI27802 Running Program Control Flow issues error message CRRZJ0004E
    PI28023 Debugging with nested calls can result in original file being removed
    PI28082 Code Coverage report shows incorrect Coverage percentage
    PI28158 CRRDG3002E Connection lost when debugging batch program in Traditional Chinese
    PI28750 Translation error in the z/OS project view
    PI29533 Changes to the HLAsm Parser causes negative values to be added to the User Macro File

    9.1.1: Host Options UI23762 PTF
    Link Date Released Status
    APAR Description
    PI17909 Integrated debugger issue when debugging a CICS transaction that makes an EXEC CICS XCTL call
    PI18677 Rational Developer for System z V9110 Internal Defects and Enhancements - RSE: Click on APAR link to view list of defects and enhancements
    PI18688 Rational Developer for System z V9110 Internal Defects and Enhancements - NONRSE: Click on APAR link to view list of defects and enhancements
    PI22132 Install using FEKINIT produces equal RSED (BAD) and DBGMGR (GOOD) proclib members
    PI23777 Rational Developer for System z V9110 Internal Defects and Enhancements - OPENRSE: Click on APAR link to view list of defects and enhancements
    PI25953 RSE holds lock on a user data set
    PI26429 Users not allowed to modify the generated JCL when created via 'Add Element' function
    PI26493 CARMA Endevor - receive "CRRZC0301E The required RAMID is missing" using enhanced edit
    PI27033 Rational Developer for System z not accepting logons and/or high CPU and/or ABEND878-10 followed by ABEND40D can be observed
    PI27614 Integrated debugger on z/OS 2.1 may cause ABENDS0C4 in CEEHDSP debugging C program
    PI28388 CARMA Endevor 'Preview JCL' on batch action returns "Job submit error: Unable to ..."
    PI28621 One or more ABEND878-10 received in native LE HEAP storage

    9.1.1: Host Utilities UI23671, UI23674 and UI23675 PTFs
    Link Date Released Status
    APAR Description
    PI18894

    Rational Developer for System z Utilities 9.1.1 Defects and Enhancements: Click on APAR link to view list of defects and enhancements
    PI21624
    PI21625
    PI25616

    9.1.x iFix 2 Java Platform Update
    Link Date Released Status
    APAR Description
    -- IBM Java Platform Standard Edition 7 Service Refresh 8+IV66375

    9.1.x iFix 1 Java Platform Update
    Link Date Released Status
    APAR Description
    -- IBM Java Platform Standard Edition 7 Service Refresh 7 Fix Pack 1

    Initial Release (9.1)
    Link Date Released Status
    APARs Description
    PI04724 Rational Developer for System z : The LPEX Editor wrongly displays syntax error with Hebrew characters
    PI10838 Rational Developer for System z: Open Declaration opened from JES using "Show JCL" has no effect in the JCL Editor
    PI11258 Rational Developer for System z: Code review covers only last directory specified in the -directory option
    PI11317 Rational Developer for System z: When CARMA Endevor Define Package is used to modify the existing package, the package details are not populated
    PI15614 Rational Developer for System z: Menu Manager local files are incorrectly created as directories

    Table of Contents:


    9.5.1.1 iFix 1 9.5.1 iFix 1
    Link Date Released Status
    APAR Description
    PI64640 Errors occur while trying to install Rational Developer for z Systems version 9.5.1.1 onto a LINUX machine

    Fix Pack 1 - Client
    Link Date Released Status
    APAR Description
    PI42333 Client will hang after opening SAM data set with the LPEX editor
    PI50437 Syntax highlighting of PL/I editor is incorrectly displayed above default 72 characters with extended setting
    PI52771 JCL editor issues a warning when a data set member in the JCL is named default
    PI53217 Receiving error 'The test data data set does not exist' when generating zUnit test case
    PI53905 Client disallows codepage switch
    PI54559 PL/I compare needs preference "Ignore sequence number " and "Ignore white spaces"
    PI54742 PL/I editor incorrectly flags SQLCA symbols as syntax errors
    PI55468 JOBCARD member name not remembered on Submit package wizard
    PI56026 Client does not parse comma when a preprocessor is invoked
    PI56754 Remote systems LPEX edit view not updated automatically after performing filter by selection action
    PI56755 Submit action missing from LPEX context menu for JCL source
    PI56951 PL/I content assist makes wrong proposals
    PI57074 SQL Results cannot be removed
    PI57302 Exception received when copybooks are not included
    PI57648 Host Connection Emulator fails to connect using SSL with MSCAPI
    PI58349 @ in an embedded JCL statement causes Content Assist menu label to be split
    PI58362 zUnit wizard does not indicate that VSAM data sets are not supported
    PI58973 MVS files are not accessible from RSE after upgrade to Rational Developer for z Systems 9.5
    PI59637 JCL editor raises an invalid error on NOTIFY parameter
    PI59846 PL/I real time syntax check gets error "Failed to create symbol table" AssertionFailedException
    PI60427 Remote z/OS File Search GUI does not expand filters
    PI60671 Customized Menu Manager submit does not give option to Notify or locate job
    PI60830 PL/I editor may incorrectly report nested PL/I IF-ELSE statements as being in error
    PI61682 Menu Manager variable, $projectname, is not filled when sent from the PL/I editor
    PI61817 COBOL editor throws unexpected ERROR_TOKEN on usage of DECIMAL-POINT is COMMA
    PI62308 Remote z/OS file search results may be incomplete if "Result Update Frequency" preference is set to "Low"
    PI18801 Users not able to migrate their custom perspectives from v8.x to v9.0

    9.5.1.1: Host Options UI38196 PTF
    Link Date Released Status
    APAR Description
    PI60442 Rational Developer for System z V9511 Internal Defects and Enhancements

    9.5.1.1: Host Utilities UI38159, UI38160, UI38161 and UI38162 PTFs
    Link Date Released Status
    APAR Description
    PI56494

    Rational Developer for System z Utilities 9.5.1.1 Defects and Enhancements: Click on APAR link to view list of defects and enhancements
    PI56497
    PI56501
    PI56513

    9.5.x iFix 3 Java Platform Update
    Link Date Released Status
    APAR Description
    -- IBM Java Platform Standard Edition 8 Service Refresh 3 - Multiple vulnerabilities in IBM Java SDK affects Rational Developer for z Systems (CVE-2016-0363 and CVE-2016-0376)

    9.5.1: Host Options UI37226 PTF
    Link Date Released Status
    APAR Description
    PI56005 Rational Developer for z Systems V9510+ Internal Defects and Enhancements
    PI58968 Failure with error C1G0314E when attempting to add a new element

    9.5.x iFix 2 Java Platform Update
    Link Date Released Status
    APAR Description
    -- IBM Java Platform Standard Edition 8 Service Refresh 2 Fix Pack 10 - Vulnerability in IBM Java SDK affects Rational Developer for z Systems (CVE-2015-7575)

    9.5.1 iFix 2
    Link Date Released Status
    APAR Description
    - Vulnerabilities in GSKit affect Rational Developer for System z (CVE-2016-0201), (CVE-2015-7421), (CVE-2015-7420)

    9.5.1 iFix 1
    Link Date Released Status
    APAR Description
    PI55457 Errors occur while trying to install Rational Developer for z Systems version 9.5.1 onto a LINUX machine

    9.5.x iFix 1 Java Platform Update
    Link Date Released Status
    APAR Description
    -- IBM Java Platform Standard Edition 8 Service Refresh 2

    9.5 Mod Release 1
    Link Date Released Status
    APAR Description
    PI37012 Open PDS member of an archived data set fails in JCL editor
    PI52243 Data elements table does not display the correct PL/I elements unless a data element is selected
    PI52808 NPE with "Associating an included file with a compile program" after using the "Clear the association" OPTION
    PI53020 Incorrect STEPNAME used in generated user build JCL
    9.5 Host Mod Release 1
    Link Date Released Status
    9.5: Host Options UI34563 PTF
    Link Date Released Status
    APAR Description
    PI55488 Rational Developer for z Systems 9.5.0 systems get a wide variety of symptoms due to a 6 byte storage overlay in the CSA or ECSA.

    Interim Fix 1 (9.5_iFix001)
    Link Date Released Status
    APAR Description
    -- Open Source Apache Commons Collections vulnerability affects Rational Developer for System z (CVE-2015-7450)
    Initial Release (9.5)
    Link Date Released Status
    APARs Description
    PI14866 Documentation for configuring remote helps to use network connection with a proxy is invalid
    PI28000 PL/I parser sets an error when a BEGIN-END clause is nested into a WHEN or OTHERWISE block
    PI29759 Remote read only file allowed to be edited in the compare editor
    PI33427 Rational Developer for z Systems does not find copybooks or include files when using a connection name that includes a slash character
    PI35706 Extract Dependencies message is in English even in another language environment
    PI38942 Incorrect German translation in "Breakpoints" window context menu
    PI42337 RSEF1002 operation failed, file size mismatch when copying a sequential file from host to PC with RSE
    PI42682 Debugging using integrated debugger with many EXEC CICS links causes transaction abend
    PI47656 The character £ is not recognized by the JCL editor

    Related information

    V.R.M.F. Maintenance Stream Delivery Vehicle glossary
    Software Product Compatibility Reports
    Fix Central

    Document information

    More support for: Rational Developer for System z
    Documentation

    Software version: 8.5, 8.5.0.1, 8.5.1, 8.5.1.1, 8.5.1.2, 8.5.1.3, 8.5.1.4, 8.5.1.5, 8.5.1.6, 9.0, 9.0.1, 9.0.1.1, 9.0.1.2, 9.0.1.3, 9.0.1.4, 9.0.1.5, 9.1, 9.1.1, 9.1.1.1, 9.1.1.2, 9.1.1.3, 9.5, 9.5.1

    Operating system(s): Linux, Windows, z/OS

    Reference #: 7036693

    Modified date: 2016-06-27