Fix List for IBM Operational Decision Manager

Release notes


Abstract

IBM provides periodic fixes for the Operational Decision Manager family (formely known as WebSphere Operational Decision Management). The following is a complete list of fixes for the components IBM Decision Server and IBM Decision Center.

Content

Version 8

Release 8.6

release date 6 June 2014
status current

Fix Pack 8.5.1.1

release date 17 July 2014
status current

Mod 8.5.1

release date 29 November 2013
status superseded

Release 8.5

release date 7 June 2013
status superseded

Fix Pack 8.0.1.2

release date 27 March 2014
status current

Fix Pack 8.0.1.1

release date 10 June 2013
status superseded

Mod 8.0.1

release date 30 November 2012
status superseded

Fix Pack 8.0.0.1

release date 30 august 2012
status superseded

Release 8.0

release date 08 June 2012
status superseded

Version 7

Fix Pack 7.5.0.4

release date 03 April 2013
status current

Fix Pack 7.5.0.3

release date 05 December 2012
status superseded

Fix Pack 7.5.0.2

release date 05 June 2012
status superseded

Fix Pack 7.5.0.1

release date 12 December 2011
status superseded

Release 7.5

release date 18 November 2011
status superseded

Release 8.6 (8.6.0.0)

Decision Server Rules - zRule Execution Server
PM88586 SMF RECORDS SHOW WRONG PRODUCT ID
PM91199 zRES will not shut down after abend
PM91201 ABEND 0C4, NAME=CELQLIB IN ZRES AFTER CANCEL OF COBOL CLIENT
PM91694 ZRES USES STCKF INSTRUCTION WHICH IS NOT SUPPORTED ON OLDER HARDWARE
PM93346 CICS JVM CAN NOT EXECUTE SOME RULE APPLICATIONS

Operational Decision Management - All
RS01320 WRONG DATE EDITOR SHOWN IN AUTOMATIC MODE DT
RS01322 RULE ANALYSIS FAILS WITH NULLPOINTEREXCEPTION
RS01333 INCONSISTENT MERGE OF EMPTY DECISION TABLE CELLS
RS01349 THE LOCKING OF COLUMN EXPRESSION IS INCONSISTENT
RS01384 EMBEDDED RULES - DECISION TABLE CELL VALUE EDITOR HAS NARROW SPACING WHEN USING STYLESHEETS OTHER THAN CLARO
RS01484 RULESTEMPLATERESOURCE.JAR NOT FOUND WHEN RUNNING CONFIGUREDCCLUSTER AND CONFIGUREDSCLUSTER SCRIPTS
RS01492 VARIABLE NOT INITIALIZED IN SCRIPT TO UNINSTALL DECISION CENTER FROM CLUSTER
RS01500 [LAUNCHPAD] SAMPLE SERVER INSTALL PANEL DOES NOT DESCRIBE ACCURATELY ODM EXPRESS INSTALLATION

Decision Server Rules - Rule Designer
PI16188 UNMARSHAL TRIM ERROR FOR COBOL NUMERIC DISPLAY DATA ITEM WHEN CONVERTER IS USED
RS01331 INCORRECT TYPE IS DISPLAYED IN THE RULE DESIGNER DEBUGGER
RS01355 RULE DESIGNER STILL SHOWS AN OUTGOING CHANGE AFTER PUBLISHING A PROJECT FILE THAT WAS MOVED INTO A SPECIFIC FOLDER, RENAMED OR D
RS01360 DOMAIN VALUES FOR ARRAY TYPE ARGUMENT CANNOT BE EDITED IN RULE DESIGNER
RS01370 RULEAPP DEPLOYED/EXPORTED FROM RULE DESIGNER DOES NOT MAKE USE OF RULEAPP NAME DEFINED IN THE LOCAL ARCHIVE.XML
RS01407 WHEN BINDING A VARIABLE TO AN OBJECT TYPE IN A COLLECTION OF XSDANYTYPE, THE OBJEC TYPE DEFINED IN BAL IS LOST IN IRL.
RS01409 RULE DESIGNER SHOULD NOT FALL BACK ON A COUNTRY NEUTRAL 2 LETTER LOCALE
RS01450 [RD] OUTPUT PARAMETER NOT VISIBLE IN VARIABLES TAB WHEN DEBUGGING DVS EXCEL FILE
RS01479 [RD] RULE PACKAGE REFERENCE IN THE RULE TASK IS NOT REFACTORED
RS01510 NPE WHEN RUNNING PROJECTMIGRATIONTOOL ON SOLUTION CONTAING ENUM WITH NO VERBALIZATION

Decision Server Events - Event Designer
RS01327 INVALID THREAD ACCESS WHEN BUILDING PROJECT WITH READ ONLY FILES
RS01346 BEER6738E ERROR WHEN DEPLOYING AN EVENT PROJECT FROM EVENT DESIGNER TO EVENT RUNTIME
RS01359 BEER1230E REPORTED WHEN A SYNTHETIC EVENT IS REVERTED TO THE SYSTEM CONTEXT
RS01367 TRACK EVENTS NOT GETTING FIRED
RS01406 EVENT DESIGNER CREATED MULTIPLE VERBALIZATION ELEMENTS WHEN EDITING A RULE IN A NEW LOCALE
RS01430 IMPORTED ODM 8.0 XML EVENT PROJECT IN EVENT DESIGNER 8.5 AND THEN PUBLISHED TO DECISION CENTER LEAD TO AN EXCEPTION
RS01433 [DOC]INCORRECT SILENT INSTALL INSTRUCTIONS IN ODM V8.5 DOCUMENTATION
RS01451 JAVASCRIPT UPDATE CANNOT BE SAVED IN EVENT DESIGNER IN NON-ENGLISH LOCALE
RS01475 EVENT DESIGNER DOES NOT FORGET PREVIOUS STYLE SHEET SETTINGS AFTER CONNECTOR CONNECTIONS ARE RESET
RS01499 RULE GROUP EDITOR IS NOT DELETING RULE ASSET IN PROJECT MODEL WHEN DELETING A RULE
RS01506 A SINGLE RULE IN A RULE GROUP TURNED INTO A REGULAR RULE AFTER EVENT PROJECT IS EXPORTED AND RE-IMPORTED IN EVENT DESIGNER.
RS01511 SYNTHETIC EVENT MAPPING FIELDS INCORRECTLY
RS01513 TEMPORAL RUNTIME CONNECTION INFORMATION IS NOT USED WHEN IMPORTING AN EVENT PROJECT FROM V7 PROJECT STORE

Decision Server Rules - Rule Execution Server
RS01332 DE FOR ZRES RULESET EXPORT FAILS WITH ARRAYINDEXOUTOFBOUNDSEXCEPTION
RS01336 CANNOT INITIALIZE A VARIABLE USING A RULESET PARAMETER VALUE IN DECISION ENGINE
RS01344 IS ONE OF TEST LISTING AN EMPTY STRING CAUSES STRINGINDEXOUTOFBOUNDSEXCEPTION
RS01345 SUPPORT DECIMAL FORMATTING XSD FACETS IN EMBEDDED RULES
RS01347 DAOEXCEPTION SHOWS DATABASE PASSWORD IN CLEAR
RS01350 HTDS MAY LOOSE SOME PARAMETER VALUES WHEN USING A JAVA XOM
RS01393 UNEXPECTED CLASSCASTEXCEPTION WITH SEQUENTIAL ALGORITHM
RS01463 ILRDATETIME DOES NOT RESPECT THE SPECIFICATION OF THE W3C
RS01483 BLANK COLUMNS IN DECISION TABLES PRODUCE DIFFERENT EXECUTION BEHAVIOR IN CRE AND DE
RS01531 HTDS EXECUTION FAILS WITH PREFIX NOT BOUND TO A NAMESPACE ERROR
RS01533 RES CONSOLE ALLOWS CACHING OF SSL CONTENT
RS01534 XSS VULNERABILITY IN RES CONSOLE THROUGH AUTOSCROLL PARAMETER
RS01549 NPE THROWN ON ENUM RULESET PARAMETER WHEN RETREIVING WSDL FROM HTDS/REST
RS01550 DECISION SERVER CLUSTER CONFIGURATION SCRIPT FAILS WITH AN OUTOFMEMORYERROR ON SUN SYSTEMS
RS01553 IMPROVE RES CONSOLE HANDLING OF TCPIP XU DISCONNECTION
RS01562 INCORRECT LOCAL_DEPLOYMENT_ONLY VALUE IN SSP WEB.XML

Decision Server Events - Event Runtime
RS01356 BEER2736W ERROR WHEN A PACKET WAS RECEIVED THAT CONTAINS MORE THAN ONE EVENT PACKET.
RS01411 [EVENT]MISSING WBEMQMSGINGTRANSTYPEDEFAULTER.IJC AND WBEMQMSGINGTRANSTYPEVALIDATOR.IJC FILES
RS01440 DOCUMENTATION TO MIGRATE THE EVENT RUNTIME OMITS THE STEP TO UPDATE PROPERTY 'HISTORY_SCHEMA_VER'
RS01523 FILTER "THE IDS OF THE ARRAYOBJECTS CONTAIN THE TEMP ID OF THE TEMPOBJECT" IS UNDEPLOYABLE
RS01540 TIME BASED ASSETS ARE SOMETIMES NOT REMOVED FROM DB
RS01545 TIMEDELAYENGINE DEADLOCK WHILE DELEATING A CONTEXT
RS01569 SYNTHETIC EVENTS ARE NOT DISPATCHED DIRECTLY TO SLAVE IF THEY ARE PART OF A CONTEXT DEFINITION
RS01598 EVENTS CONNECTORS_SERVICE.BAT UNABLE TO START A WINDOWS SERVICE
RS01611 HIGH CPU USAGE BY TECHNOLOGY ACTION CONNECTORS AFTER WBE RUNTIMESHUTDOWN
RS01612 STEPS TABLE PRUNING ISSUES WITH ODM EVENTS V8.5.1

Decision Center
RS01295 DOMAINS VALUES ARE NOT SORTED ACCORDINGLY IN THE ENTERPRISE CONSOLE DYNAMIC DOMAINS UPDATE VIEW
RS01299 DYNAMIC DOMAINS UPDATE VIEW DOES NOT STAY ON CURRENT PAGE
RS01300 TEST CONNECTION TO DECISION SERVER FROM DECISION CENTER FAILS WHEN THE URL ENDS WITH /
RS01303 RULEDOCS DON'T INCLUDE RULESET PARAMETERS FROM DEPENDENCY PROJECT
RS01312 ENCOUNTERED SQL EXCEPTION WHEN APPLYING THE TEAMSERVER SQL SCRIPT GENERATED FROM CUSTOM MODEL EXTENSION
RS01318 RULE PROJECT SYNCHRONIZATION WITH THE ANT TASK DOES NOT USE THE BRANCH PARAMETER
RS01321 PROFILE NAME WITH NON ASCII CHARACTERS SUCH AS JAPANESE/CHINESE CHARACTERS NOT HANDLED PROPERLY IN BUSINESS CONSOLE
RS01323 ANT SYNCHRONIZATION DOES NOT PUBLISH DELETED RULES
RS01324 ERASE PROJECT IN DECISION CENTER FAILS WITH NULLPOINTEREXCEPTION
RS01328 RULEFLOW WITH FORMAT 6.7 PUBLISHED TO DECISION CENTER CANNOT BE OPENED
RS01329 FAILURE TO REMOVE TEMPORARY BASELINES ON DEPENDENT PROJECTS AFTER RULESET GENERATION COMPLETES
RS01335 RULES ARE NOT IN PACKAGES AFTER SYNCHRONIZATION
RS01337 WRONG HANDLING OF LOCALE CONVERSION FAILURE IN THE BUSINESS CONSOLE
RS01338 WRONG HANDLING OF LOCALE CONVERSION FAILURE IN ENTERPRISE CONSOLE
RS01351 WEB DT - CUSTOMPARAMETERS NOT SENT IN THE INTELLITEXT REQUESTS
RS01353 CANNOT SELECT A DEPLOYMENT BASELINE WHEN CREATING TEST SUITE IN DECISION CENTER
RS01354 SYNCHRONIZATION DETECTS OUTPUT FILES WHICH ARE NOT SYNCHRONIZABLE
RS01358 CONTEXT ID DISAPPEARS WHEN EDITING AN EVENT RULE IN DECISON CENTER
RS01361 UNEXPECTED QUERY ERROR UPON PUBLISHED TO DC
RS01362 UNABLE TO WRITE RULE IN INTELLIRULE EDITOR USING INTERNET EXPLORER AND MICROSOFT CHINESE/JAPANESE IME
RS01366 RSO EXCEL RULE DOC CRASHED WITH REPLACE/ REPLACE ALL ACTION
RS01368 SYNCHRONIZATION DOES NOT HANDLE THE REMOVAL OF IMPORTS IN A RULESET FUNCTION
RS01372 [RSO] FILE "SAVE AS" DOES NOT KEEP FILE NAME
RS01373 [RSO] CLEARING A ROW WITH THE DELETE KEY DOES NOT CLEAR THE EDIT BAR
RS01374 VALIDATOR IS NOT USED DURING RULEAPP GENERATION
RS01378 DVS RUN FAILS WITH COLLECTION OF ENUM TYPE
RS01379 [DC] THE FOLDER NAME OF THE RULE PROJECT EXPORTED FROM DC ARE IN ENGLISH REGARDLESS OF THE PERSISTENCE LOCALE.
RS01386 CROSS SITE SCRIPTING VULNERABILITY THROUGH BRANCH NAMES
RS01388 INCOMPATIBLE WITH ILRRESOURCE ERROR DURING SYNCHRONIZATION
RS01392 VARIABLES MISSING WHEN EDITING RULES IN DECISION CENTER
RS01399 [RSO] DELETION OF MULTIPLE DT ROWS LEADS TO TEMPORARY FREEZE
RS01400 SUBFLOW TASK UUID NOT CONVERTED DURING SYNCHRONIZATION
RS01403 CHINESE DROPDOWN ITEMS TRUNCATED IN DT EDITOR WHEN EDITING AN EXISTING SELECTION IN ZH_CN LOCALE
RS01405 [DC] ERROR WHEN EXPORTING A RULE PROJECT THAT CONTAINS DT TEMPLATE
RS01410 RULE COPY HAS EMPTY DEFINITION
RS01412 NPE ON BRANCH MERGE OF EVENT PROJECT
RS01417 [DC]DEPLOYMENT BASELINE FROM 7.0 REPOSITORY HAS NOT MIGRATED PROPERLY TO 8.0 AND 8.5.
RS01419 [DC]DEPENDENCIES TO MIGRATED BASELINES ARE NOT HANDLED BY DC FINDERS
RS01421 [DC]SQLEXCEPTION ON DERBY DATABASE WHEN GENERATING A RULEAPP
RS01423 SUB-PACKAGES ADDED IN A BRANCH MAY NOT BE INCLUDED IN RULEFLOW IRL WHEN BUILDING THE RULESET
RS01425 SECURITY SETTINGS IS NOT MIGRATED FROM 7.0/7.1 TO 7.5, 8.0 AND 8.5
RS01426 DROP-DOWN SHOWS AT THE WRONG PLACE IN QUICK EDIT WITH INTERNET EXPLORER
RS01429 GENERATED DT HTML STRING CONTAINS INCORRECT FORMAT
RS01434 [DC]RUNNING MIGRATION SCRIPT THROWS ENDV FOREIGN KEY VIOLATION ERRORS.
RS01449 [DC] CANNOT CONNECT TO DC CONSOLE AFTER MIGRATION
RS01452 RULESET & ADVANCED PROPERTIES ARE NOT SYNCHRONIZED TO DECISION CENTER
RS01453 [DC] VERTICAL SCROLLBAR IS NOT ENABLED IN CATEGORY SELECTOR
RS01455 IMPOSSIBLE TO RE-DEPLOY A RULEAPP WITH MORE THAN ONE RULESET FROM RULE TEAM SERVER
RS01456 [DC] CANNOT EDIT DECISION TREE IN ENTREPRISE CONSOLE USING IE9
RS01462 DISCREPANCY IN THE LIST OF TABLES CREATED VS THOSE GRANTED ALL PERMISSIONS IN JCL FILES
RS01464 PERFORMANCE ISSUE ON FIRST CONNECTION AFTER DC REPOSITORY MIGRATION
RS01465 MIGRATION SCRIPT MAY FAIL WITH BASELINECONTENT FOREIGN KEY VIOLATION.
RS01466 DISPLAYING THE CONTENT OF A RULE PROJECT IN BUSINESS CONSOLE IS PAINFULLY SLOW
RS01467 NPE WHEN REMOVING A CA AND THEN A ANNOYING RECURRENT WARNING
RS01468 WRONG RULE DISPLAYED IN BUSINESS CONSOLE WHEN NAVIGATING THROUGH THE LIBRARY TAB
RS01469 DB2 SQL EXCEPTION DURING RULE SYNCHRONIZATION
RS01471 [DC] CHECK UUID WARNINGS IN DIAGNOSTIC DUE TO RULE ACTIFACT RECORDS NOT DELETED FROM BRSTUDIO TABLE
RS01472 DECISION CENTER QUERY DOES NOT RETURN A RULEFLOW WHICH DIRECTLY SELECTS A DECISION TABLE IN THE SCOPE OF ONE OF ITS TASKS
RS01473 [DC] RULEFLOW IS NOT CORRECTLY DISPLAY IF DC USES A DIFFERENT LOCALE
RS01474 MISSING SECURE ATTRIBUTE IN ENCRYPTED SESSION (SSL) COOKIE FOR TEAMSERVER_DATASOURCE
RS01476 [DC] WEB COMPONENT VARIABLE LOCALEDIR IS NOT DEFINED
RS01478 "WORK ON A DECISION SERVICE" OPTION NOT DISPLAYED IN DECISION CENTER CONSOLE
RS01485 PERFORMANCE ISSUE WITH MIGRATION SCRIPT WHEN HANDLING ELEMENTS VERSIONS
RS01487 NPE WHEN NAVIGATING IN THE BUSINESS CONSOLE
RS01488 CANNOT OPEN EXPLORE TAB BECAUSE OF PERFORMANCE ISSUE WITH A LARGE REPOSITORY
RS01491 EXCEPTION RAISED WHEN TRYING TO EXPORT A RULE PROJECT MIGRATED FROM OLDER RELEASE, OR WHEN CREATING A FOLDER OR BRANCH
RS01496 DVS TEST COMPARISON MAY FAIL FOR DATES THAT ARE EQUAL PRIOR TO 1911 IN FRENCH TIMEZONE
RS01498 UNABLE TO LOGIN AGAIN IN DECISION CENTER BUSINESS WHEN THE PERMISSION ON THE LAST BRANCH USED HAVE CHANGED
RS01502 NPE WHEN DEPLOYING AN EVENT PROJECT WITH A BASELINE
RS01503 [EC] MODIFIED RULES IN CHANGE ACTIVITY NOT FOUND FROM TEST SUITE RESULT'S LINK
RS01508 [EC] UNABLE TO COPY A SMART FOLDER
RS01512 [DC]PERFORMANCE REGRESSION BETWEEN 7.1 AND UPPER RELEASES
RS01520 QUERY IN DC DOES NOT FIND A RULEFLOW SELECTING A DT WITH A NAME CONTAINING A SPECIAL CHARACTER
RS01521 TOOLTIP FOR CATEGORY PROPERTY FIELD IN DECISION CENTER SHOWS UNEXPECTED HTML TAG WHEN THERE IS MORE THAN ONE CATEGORY
RS01525 UNABLE TO CREATE A NEW RULEAPP FOR THE ONLY DECISION SERVICE IN DC
RS01529 PERFORMANCE ISSUE BROWSING A SUB-BRANCH COMPARED TO THE MAIN BRANCH
RS01532 ENTERPRISE CONSOLE DOES NOT DISPLAY CORRECTLY IN IE10
RS01535 INCORRECT RULESET UPON REDEPLOY OF RULEAPP FROM DECISION CENTER
RS01536 ILRCANNOTDELETEEXCEPTION WHEN TRYING TO DELETE A SUB-BRANCH
RS01537 VALUE OF A CUSTOM PROPERTY FOR TECHINICALRULE SET IN RULE DESIGNER IS PUBLISHED AS A TAG IN DECISION CENTER
RS01538 SOME QUERIES ARE NOT PROPERLY TRANSLATED TO SQL
RS01539 NEW RULE PROJECT FROM DECISION CENTER DROP-DOWN LISTS ALL RULE PROJECT REGARDLESS OF USER PERMISSIONS
RS01543 UNABLE TO SAVE CHANGES TO THE EXTRACTOR FOR A RULESET WITH DEPLOYMENT BASELINES
RS01556 PERFORMANCE ISSUE BROWSING A REPOSITORY WITH MANY FOLDERS
RS01558 SLOWNESS IN EXPANDING FOLDER WHEN COPYING A RULE
RS01564 [EC] RTSCONFIG CAN EDIT PROJECT SECURITY
RS01586 [DC] SOME SUB-BRANCHES CANNOT BE DELETED AFTER A MERGE
RS01656 STRINGINDEXOUTOFBOUNDSEXCEPTION WHEN CREATING A NEW RULE ELEMENT WITH AUTOMATIC BUILD ENABLED

Fix Pack (8.5.1.1)

Decision Server Rules - Rule Designer
PI16188 UNMARSHAL TRIM ERROR FOR COBOL NUMERIC DISPLAY DATA ITEM WHEN CONVERTER IS USED
RS01407 WHEN BINDING A VARIABLE TO AN OBJECT TYPE IN A COLLECTION OF XSDANYTYPE, THE OBJEC TYPE DEFINED IN BAL IS LOST IN IRL.
RS01479 [RD] RULE PACKAGE REFERENCE IN THE RULE TASK IS NOT REFACTORED

Decision Server Events - Event Designer
RS01430 IMPORTED ODM 8.0 XML EVENT PROJECT IN EVENT DESIGNER 8.5 AND THEN PUBLISHED TO DECISION CENTER LEAD TO AN EXCEPTION
RS01451 JAVASCRIPT UPDATE CANNOT BE SAVED IN EVENT DESIGNER IN NON-ENGLISH LOCALE
RS01475 EVENT DESIGNER DOES NOT FORGET PREVIOUS STYLE SHEET SETTINGS AFTER CONNECTOR CONNECTIONS ARE RESET
RS01499 RULE GROUP EDITOR IS NOT DELETING RULE ASSET IN PROJECT MODEL WHEN DELETING A RULE
RS01506 A SINGLE RULE IN A RULE GROUP TURNED INTO A REGULAR RULE AFTER EVENT PROJECT IS EXPORTED AND RE-IMPORTED IN EVENT DESIGNER.
RS01511 SYNTHETIC EVENT MAPPING FIELDS INCORRECTLY
RS01513 TEMPORAL RUNTIME CONNECTION INFORMATION IS NOT USED WHEN IMPORTING AN EVENT PROJECT FROM V7 PROJECT STORE

Operational Decision Management - All
RS01484 RULESTEMPLATERESOURCE.JAR NOT FOUND WHEN RUNNING CONFIGUREDCCLUSTER AND CONFIGUREDSCLUSTER SCRIPTS
RS01492 VARIABLE NOT INITIALIZED IN SCRIPT TO UNINSTALL DECISION CENTER FROM CLUSTER
RS01614 SILENT INSTALL OF PROFILE TEMPLATES USING OW_SILENT.XML FAILS

Decision Server Rules - zRule Execution Server
PI15995 UNABLE TO LOG DECISION WAREHOUSE TRACE IN A CICS JVM
RS01627 SMF TYPE 120 SUBTYPE 100 RECORDS HAVE NO DATA OR ARE NOT FORMATTED CORRECTLY

Decision Server Events - Event Runtime
RS01523 FILTER "THE IDS OF THE ARRAYOBJECTS CONTAIN THE TEMP ID OF THE TEMPOBJECT" IS UNDEPLOYABLE
RS01540 TIME BASED ASSETS ARE SOMETIMES NOT REMOVED FROM DB
RS01545 TIMEDELAYENGINE DEADLOCK WHILE DELEATING A CONTEXT
RS01569 SYNTHETIC EVENTS ARE NOT DISPATCHED DIRECTLY TO SLAVE IF THEY ARE PART OF A CONTEXT DEFINITION
RS01598 EVENTS CONNECTORS_SERVICE.BAT UNABLE TO START A WINDOWS SERVICE
RS01611 HIGH CPU USAGE BY TECHNOLOGY ACTION CONNECTORS AFTER WBE RUNTIMESHUTDOWN
RS01612 STEPS TABLE PRUNING ISSUES WITH ODM EVENTS V8.5.1
RS01650 PRUNING STEPS TABLE USING JMX INTERFACE COMMAND REMOVECONTEXT DOES NOT WORK AS EXPECTED.

Decision Server Rules - Rule Execution Server
RS01350 HTDS MAY LOOSE SOME PARAMETER VALUES WHEN USING A JAVA XOM
RS01483 BLANK COLUMNS IN DECISION TABLES PRODUCE DIFFERENT EXECUTION BEHAVIOR IN CRE AND DE
RS01533 RES CONSOLE ALLOWS CACHING OF SSL CONTENT
RS01534 XSS VULNERABILITY IN RES CONSOLE THROUGH AUTOSCROLL PARAMETER
RS01549 NPE THROWN ON ENUM RULESET PARAMETER WHEN RETREIVING WSDL FROM HTDS/REST
RS01553 IMPROVE RES CONSOLE HANDLING OF TCPIP XU DISCONNECTION
RS01562 INCORRECT LOCAL_DEPLOYMENT_ONLY VALUE IN SSP WEB.XML
RS01651 TBI UNSUPPORTEDOPERATIONEXCEPTION WHEN GENERATING A DECISION ENGINE RULESET
RS01665 UNNECESSARY DNS LOOKUPS WITH MANAGED XOM

Decision Center
RS01057 XSD XOM CHANGED NOT DETECTED AT SYNCHRONIZATION
RS01429 GENERATED DT HTML STRING CONTAINS INCORRECT FORMAT
RS01452 RULESET & ADVANCED PROPERTIES ARE NOT SYNCHRONIZED TO DECISION CENTER
RS01453 [DC] VERTICAL SCROLLBAR IS NOT ENABLED IN CATEGORY SELECTOR
RS01456 [DC] CANNOT EDIT DECISION TREE IN ENTREPRISE CONSOLE USING IE9
RS01462 DISCREPANCY IN THE LIST OF TABLES CREATED VS THOSE GRANTED ALL PERMISSIONS IN JCL FILES
RS01464 PERFORMANCE ISSUE ON FIRST CONNECTION AFTER DC REPOSITORY MIGRATION
RS01465 MIGRATION SCRIPT MAY FAIL WITH BASELINECONTENT FOREIGN KEY VIOLATION.
RS01466 DISPLAYING THE CONTENT OF A RULE PROJECT IN BUSINESS CONSOLE IS PAINFULLY SLOW
RS01467 NPE WHEN REMOVING A CA AND THEN A ANNOYING RECURRENT WARNING
RS01468 WRONG RULE DISPLAYED IN BUSINESS CONSOLE WHEN NAVIGATING THROUGH THE LIBRARY TAB
RS01469 DB2 SQL EXCEPTION DURING RULE SYNCHRONIZATION
RS01471 [DC] CHECK UUID WARNINGS IN DIAGNOSTIC DUE TO RULE ACTIFACT RECORDS NOT DELETED FROM BRSTUDIO TABLE
RS01472 DECISION CENTER QUERY DOES NOT RETURN A RULEFLOW WHICH DIRECTLY SELECTS A DECISION TABLE IN THE SCOPE OF ONE OF ITS TASKS
RS01473 [DC] RULEFLOW IS NOT CORRECTLY DISPLAY IF DC USES A DIFFERENT LOCALE
RS01474 MISSING SECURE ATTRIBUTE IN ENCRYPTED SESSION (SSL) COOKIE FOR TEAMSERVER_DATASOURCE
RS01476 [DC] WEB COMPONENT VARIABLE LOCALEDIR IS NOT DEFINED
RS01478 "WORK ON A DECISION SERVICE" OPTION NOT DISPLAYED IN DECISION CENTER CONSOLE
RS01485 PERFORMANCE ISSUE WITH MIGRATION SCRIPT WHEN HANDLING ELEMENTS VERSIONS
RS01487 NPE WHEN NAVIGATING IN THE BUSINESS CONSOLE
RS01488 CANNOT OPEN EXPLORE TAB BECAUSE OF PERFORMANCE ISSUE WITH A LARGE REPOSITORY
RS01491 EXCEPTION RAISED WHEN TRYING TO EXPORT A RULE PROJECT MIGRATED FROM OLDER RELEASE, OR WHEN CREATING A FOLDER OR BRANCH
RS01496 DVS TEST COMPARISON MAY FAIL FOR DATES THAT ARE EQUAL PRIOR TO 1911 IN FRENCH TIMEZONE
RS01498 UNABLE TO LOGIN AGAIN IN DECISION CENTER BUSINESS WHEN THE PERMISSION ON THE LAST BRANCH USED HAVE CHANGED
RS01502 NPE WHEN DEPLOYING AN EVENT PROJECT WITH A BASELINE
RS01503 [EC] MODIFIED RULES IN CHANGE ACTIVITY NOT FOUND FROM TEST SUITE RESULT'S LINK
RS01508 [EC] UNABLE TO COPY A SMART FOLDER
RS01512 [DC]PERFORMANCE REGRESSION BETWEEN 7.1 AND UPPER RELEASES
RS01520 QUERY IN DC DOES NOT FIND A RULEFLOW SELECTING A DT WITH A NAME CONTAINING A SPECIAL CHARACTER
RS01521 TOOLTIP FOR CATEGORY PROPERTY FIELD IN DECISION CENTER SHOWS UNEXPECTED HTML TAG WHEN THERE IS MORE THAN ONE CATEGORY
RS01522 MISSING IN-CELL DROP DOWN LIST FOR LARGE DOMAINS IN RSO
RS01525 UNABLE TO CREATE A NEW RULEAPP FOR THE ONLY DECISION SERVICE IN DC
RS01529 PERFORMANCE ISSUE BROWSING A SUB-BRANCH COMPARED TO THE MAIN BRANCH
RS01532 ENTERPRISE CONSOLE DOES NOT DISPLAY CORRECTLY IN IE10
RS01535 INCORRECT RULESET UPON REDEPLOY OF RULEAPP FROM DECISION CENTER
RS01536 ILRCANNOTDELETEEXCEPTION WHEN TRYING TO DELETE A SUB-BRANCH
RS01537 VALUE OF A CUSTOM PROPERTY FOR TECHINICALRULE SET IN RULE DESIGNER IS PUBLISHED AS A TAG IN DECISION CENTER
RS01538 SOME QUERIES ARE NOT PROPERLY TRANSLATED TO SQL
RS01539 NEW RULE PROJECT FROM DECISION CENTER DROP-DOWN LISTS ALL RULE PROJECT REGARDLESS OF USER PERMISSIONS
RS01543 UNABLE TO SAVE CHANGES TO THE EXTRACTOR FOR A RULESET WITH DEPLOYMENT BASELINES
RS01556 PERFORMANCE ISSUE BROWSING A REPOSITORY WITH MANY FOLDERS
RS01558 SLOWNESS IN EXPANDING FOLDER WHEN COPYING A RULE
RS01561 INCORRECT RULE EXTENSION MODEL CLASS IN EXPORTED RULE
RS01564 [EC] RTSCONFIG CAN EDIT PROJECT SECURITY
RS01586 [DC] SOME SUB-BRANCHES CANNOT BE DELETED AFTER A MERGE
RS01607 [RULE SOLUTION FOR OFFICE] : TAGS ARE CLEARED OUT BY SYNCHRONIZATION
RS01622 TEAMSERVER CONSOLE OPTIONS DOES NOT SHOW DOCUMENTATION FIELD AS PART OF THE COLUMN TO DISPLAY
RS01656 STRINGINDEXOUTOFBOUNDSEXCEPTION WHEN CREATING A NEW RULE ELEMENT WITH AUTOMATIC BUILD ENABLED
RS01666 UNEXPECTED ERRORS DETECTED WHEN GENERATING PARALLEL RULESETS FROM DECISION CENTER

Mod Pack (8.5.1)

Decision Server Rules - zRule Execution Server
PM88586 SMF RECORDS SHOW WRONG PRODUCT ID
PM91199 zRES will not shut down after abend
PM91201 ABEND 0C4, NAME=CELQLIB IN ZRES AFTER CANCEL OF COBOL CLIENT
PM91694 ZRES USES STCKF INSTRUCTION WHICH IS NOT SUPPORTED ON OLDER HARDWARE
PM93346 CICS JVM CAN NOT EXECUTE SOME RULE APPLICATIONS

Decision Server Rules - Rule Designer
RS01322 RULE ANALYSIS FAILS WITH NULLPOINTEREXCEPTION
RS01340 RULE DESIGNER BUILD MAY PRODUCE RULEFLOW WITH EMPTY BODY
RS01355 RULE DESIGNER STILL SHOWS AN OUTGOING CHANGE AFTER PUBLISHING A PROJECT FILE THAT WAS MOVED INTO A SPECIFIC FOLDER, RENAMED OR D
RS01360 DOMAIN VALUES FOR ARRAY TYPE ARGUMENT CANNOT BE EDITED IN RULE DESIGNER
RS01370 RULEAPP DEPLOYED/EXPORTED FROM RULE DESIGNER DOES NOT MAKE USE OF RULEAPP NAME DEFINED IN THE LOCAL ARCHIVE.XML
RS01409 RULE DESIGNER SHOULD NOT FALL BACK ON A COUNTRY NEUTRAL 2 LETTER LOCALE

Operational Decision Management - All
RS01319 WRONG DATE EDITOR SHOWN FOR SIMPLE DATE IN DT
RS01320 WRONG DATE EDITOR SHOWN IN AUTOMATIC MODE DT
RS01333 INCONSISTENT MERGE OF EMPTY DECISION TABLE CELLS
RS01349 THE LOCKING OF COLUMN EXPRESSION IS INCONSISTENT
RS01371 MULTIPLE SECURITY VULNERABILITIES IN IBM JRE
RS01413 BIGINTEGER LITERAL LONG VALUE IS CAST TO INTEGER

Decision Server Rules - Rule Execution Server
RS01332 DE FOR ZRES RULESET EXPORT FAILS WITH ARRAYINDEXOUTOFBOUNDSEXCEPTION
RS01336 CANNOT INITIALIZE A VARIABLE USING A RULESET PARAMETER VALUE IN DECISION ENGINE
RS01344 IS ONE OF TEST LISTING AN EMPTY STRING CAUSES STRINGINDEXOUTOFBOUNDSEXCEPTION
RS01345 SUPPORT DECIMAL FORMATTING XSD FACETS IN EMBEDDED RULES
RS01347 DAOEXCEPTION SHOWS DATABASE PASSWORD IN CLEAR
RS01364 DB2 SCRIPT FOR DECISION SERVER CREATES A NON-UNIQUE INDEX
RS01393 UNEXPECTED CLASSCASTEXCEPTION WITH SEQUENTIAL ALGORITHM
RS01418 HELP LINK AND VIEW HTDS DESCRIPTION PAGE NOT ACCESSIBLE FOR RESDEPLOYER AND RESMONITOR

Decision Server Events - Event Runtime
RS01334 DURABLEEVENTRECEIVERBEAN NOT ALLOWED TO LOOKUP COMP/USERTRANSACTION NOR TO CALL ANY USERTRANSA
RS01356 BEER2736W ERROR WHEN A PACKET WAS RECEIVED THAT CONTAINS MORE THAN ONE EVENT PACKET.
RS01437 EVENTS ADMINISTRATION CONSOLE FAILED TO PRODUCE EVENT REPORTS

Decision Server Events - Event Designer
RS01293 RULE GROUPS ARE NOT SYNCHRONIZED FROM EVENT DESIGNER TO DECISIONCENTER
RS01325 DUPLICATE FOLDER SHOWING AFTER IMPORTING EXISTING EVENT PROJECT
RS01326 IMPROPER HANDLING OF READ ONLY FILES IN EVENT DESIGNER
RS01327 INVALID THREAD ACCESS WHEN BUILDING PROJECT WITH READ ONLY FILES
RS01346 BEER6738E ERROR WHEN DEPLOYING AN EVENT PROJECT FROM EVENT DESIGNER TO EVENT RUNTIME
RS01352 MULTIPLE ERRORS SEEN WITH IMPORT OF PROJECT FROM CLEARCASE WITH CONTEXT DEFINITIONS
RS01359 BEER1230E REPORTED WHEN A SYNTHETIC EVENT IS REVERTED TO THE SYSTEM CONTEXT
RS01367 TRACK EVENTS NOT GETTING FIRED
RS01404 IN THE EVENT LANGUAGE OPERATION ON DAY ARE NOT VERBALIZED CORRECTLY
RS01406 EVENT DESIGNER CREATED MULTIPLE VERBALIZATION ELEMENTS WHEN EDITING A RULE IN A NEW LOCALE
RS01433 [DOC]INCORRECT SILENT INSTALL INSTRUCTIONS IN ODM V8.5 DOCUMENTATION
RS01447 CLASSCASTEXCEPTION: COM.IBM.WBE.MODEL.ASACTIONFIELD INCOMPATIBLEWITH COM.IBM.WBE.MODEL.ASEVENTFIELD

Decision Center
RS01295 DOMAINS VALUES ARE NOT SORTED ACCORDINGLY IN THE ENTERPRISE CONSOLE DYNAMIC DOMAINS UPDATE VIEW
RS01299 DYNAMIC DOMAINS UPDATE VIEW DOES NOT STAY ON CURRENT PAGE
RS01300 TEST CONNECTION TO DECISION SERVER FROM DECISION CENTER FAILS WHEN THE URL ENDS WITH /
RS01303 RULEDOCS DON'T INCLUDE RULESET PARAMETERS FROM DEPENDENCY PROJECT
RS01310 [RSO] THE CALENDAR ICON DOES NOT APPEAR IN THE DT EXCEL WHEN EDITING A DATE VALUE
RS01311 CATEGORIES FILTER IS BEING IGNORED IN WEB DT
RS01312 ENCOUNTERED SQL EXCEPTION WHEN APPLYING THE TEAMSERVER SQL SCRIPT GENERATED FROM CUSTOM MODEL EXTENSION
RS01318 RULE PROJECT SYNCHRONIZATION WITH THE ANT TASK DOES NOT USE THE BRANCH PARAMETER
RS01321 PROFILE NAME WITH NON ASCII CHARACTERS SUCH AS JAPANESE/CHINESE CHARACTERS NOT HANDLED PROPERLY IN BUSINESS CONSOLE
RS01323 ANT SYNCHRONIZATION DOES NOT PUBLISH DELETED RULES
RS01324 ERASE PROJECT IN DECISION CENTER FAILS WITH NULLPOINTEREXCEPTION
RS01328 RULEFLOW WITH FORMAT 6.7 PUBLISHED TO DECISION CENTER CANNOT BE OPENED
RS01329 FAILURE TO REMOVE TEMPORARY BASELINES ON DEPENDENT PROJECTS AFTER RULESET GENERATION COMPLETES
RS01335 RULES ARE NOT IN PACKAGES AFTER SYNCHRONIZATION
RS01337 WRONG HANDLING OF LOCALE CONVERSION FAILURE IN THE BUSINESS CONSOLE
RS01338 WRONG HANDLING OF LOCALE CONVERSION FAILURE IN ENTERPRISE CONSOLE
RS01351 WEB DT - CUSTOMPARAMETERS NOT SENT IN THE INTELLITEXT REQUESTS
RS01353 CANNOT SELECT A DEPLOYMENT BASELINE WHEN CREATING TEST SUITE IN DECISION CENTER
RS01354 SYNCHRONIZATION DETECTS OUTPUT FILES WHICH ARE NOT SYNCHRONIZABLE
RS01358 CONTEXT ID DISAPPEARS WHEN EDITING AN EVENT RULE IN DECISON CENTER
RS01361 UNEXPECTED QUERY ERROR UPON PUBLISHED TO DC
RS01362 UNABLE TO WRITE RULE IN INTELLIRULE EDITOR USING INTERNET EXPLORER AND MICROSOFT CHINESE/JAPANESE IME
RS01366 RSO EXCEL RULE DOC CRASHED WITH REPLACE/ REPLACE ALL ACTION
RS01368 SYNCHRONIZATION DOES NOT HANDLE THE REMOVAL OF IMPORTS IN A RULESET FUNCTION
RS01372 [RSO] FILE "SAVE AS" DOES NOT KEEP FILE NAME
RS01373 [RSO] CLEARING A ROW WITH THE DELETE KEY DOES NOT CLEAR THE EDIT BAR
RS01374 VALIDATOR IS NOT USED DURING RULEAPP GENERATION
RS01375 [RSO] SELECTING MULTIPLE DT ROWS LEADS TO TEMPORARY FREEZE
RS01377 BUSINESS CONSOLE CUSTOM VALUE EDITOR OPENS TWICE IN AUTOMATIC MODE
RS01378 DVS RUN FAILS WITH COLLECTION OF ENUM TYPE
RS01379 [DC] THE FOLDER NAME OF THE RULE PROJECT EXPORTED FROM DC ARE IN ENGLISH REGARDLESS OF THE PERSISTENCE LOCALE.
RS01386 CROSS SITE SCRIPTING VULNERABILITY THROUGH BRANCH NAMES
RS01388 INCOMPATIBLE WITH ILRRESOURCE ERROR DURING SYNCHRONIZATION
RS01392 VARIABLES MISSING WHEN EDITING RULES IN DECISION CENTER
RS01394 [DC] DECISION TABLE INCORRECTLY DISPLAYED IN BUSINESS/ENTERPRISE CONSOLE
RS01399 [RSO] DELETION OF MULTIPLE DT ROWS LEADS TO TEMPORARY FREEZE
RS01400 SUBFLOW TASK UUID NOT CONVERTED DURING SYNCHRONIZATION
RS01403 CHINESE DROPDOWN ITEMS TRUNCATED IN DT EDITOR WHEN EDITING AN EXISTING SELECTION IN ZH_CN LOCALE
RS01405 [DC] ERROR WHEN EXPORTING A RULE PROJECT THAT CONTAINS DT TEMPLATE
RS01410 RULE COPY HAS EMPTY DEFINITION
RS01412 NPE ON BRANCH MERGE OF EVENT PROJECT
RS01414 QUERY RESULT ON RULEFLOW THAT "MAY SELECT <A DT>" OMITS THOSE EXPLICITLY SELECTING A DECISION TABLE FOR JAPANESE PROJECTS
RS01417 [DC]DEPLOYMENT BASELINE FROM 7.0 REPOSITORY HAS NOT MIGRATED PROPERLY TO 8.0 AND 8.5.
RS01419 [DC]DEPENDENCIES TO MIGRATED BASELINES ARE NOT HANDLED BY DC FINDERS
RS01421 [DC]SQLEXCEPTION ON DERBY DATABASE WHEN GENERATING A RULEAPP
RS01423 SUB-PACKAGES ADDED IN A BRANCH MAY NOT BE INCLUDED IN RULEFLOW IRL WHEN BUILDING THE RULESET
RS01425 SECURITY SETTINGS IS NOT MIGRATED FROM 7.0/7.1 TO 7.5, 8.0 AND 8.5
RS01426 DROP-DOWN SHOWS AT THE WRONG PLACE IN QUICK EDIT WITH INTERNET EXPLORER
RS01434 [DC]RUNNING MIGRATION SCRIPT THROWS ENDV FOREIGN KEY VIOLATION ERRORS.
RS01449 [DC] CANNOT CONNECT TO DC CONSOLE AFTER MIGRATION
RS01455 IMPOSSIBLE TO RE-DEPLOY A RULEAPP WITH MORE THAN ONE RULESET FROM RULE TEAM SERVER
RS01458 DECISION CENTER USER PASSWORD MAY APPEAR IN SERVER LOG

Release 8,5 (8.5.0.0)

Decision Server Rules - zRule Execution Server
PM82378 NON ZERO JVM RETURN CODES FROM ZRES ARE BEING OVERWRITTEN

Operational Decision Management - All
RS01159 REGRESSION IN THE ECLIPSE VERSION SHIPPED IN WODM 8.0.0.1 INSTALLER
RS01206 PRODUCT INSTALLER DOES NOT INCLUDE THE .ECLIPSEPRODUCT FILE WHEN INSTALLING ECLIPSE FOR RULE DESIGNER.
RS01235 COMMA SEPARATOR FOR COLLECTION ITEMS IS NOT PARSED CORRECTLY IN DT FRENCH LOCALE
RS01252 EXCEPTION IS GENERATED WHEN INSTALLING ODM RULES ARTIFACT WITHOUT WAS PREREQUISITE TO USE WITH WEBLOGIC

Decision Center
PM76847 DECISION CENTER LIST OF GRANTS IN JOB HBRDCGRN IS INCOMPLETE
RS01098 DVS REPORTS DISPLAY INCORRECT EXPECTED AND OBSERVED VALUES WHEN TESTING A COLLECTION OF COMPLEX OBJECTS WITH VIRTUAL ATTRIBUTES
RS01136 DECISION CENTER BUSINESS CONSOLE DOES NOT DISPLAY ITEM TRANSLATION PROPERLY
RS01141 RULE SYNCHRONIZATION FAILED WITH AN NEW SET OF STATUS PROPERTY VALUES
RS01144 Rule order in a folder defined in Rule Designer is not published to DC
RS01146 DYNAMIC PRIORITIES NOT PUBLISHED TO DECISION CENTER
RS01157 DVS TEST RAISES ILRBOMTYPENOTFOUNDEXCEPTION WHEN THE RULESET HASNO BOM
RS01158 DOMAIN NAMES TRUNCATED IN DVS EXCEL SCENARIO SUITES
RS01162 llegalArgumentException may occur when testing ruleset with the DVS Excel flat format
RS01166 RSO REPORTS "INCOMPLETE ACTION" ERROR WHEN THERE IS A DEFAULT VALUE IN DT ACTION DEFINITION
RS01172 CANNOT PUBLISH A NEW BOM ENTRY INTO A BRANCH IN DECISION CENTER
RS01184 DEFAULT VALUES ARE NOT DISPLAYED IN THE RULEDOC CELL WHEN A DT IS PUBLISHED FROM DECISION CENTER TO RSO
RS01190 FROZEN CONDITIONS FROM A RULE TEMPLATE CAN BE MODIFIED IN A RULE
RS01198 PERFORMANCE ISSUE WHEN USING RULEDOCS
RS01203 USER LOCALE IGNORED WHEN EDITING RULE
RS01205 MANAGE SERVERS PAGE CAN ONLY SHOW FIRST 10 SERVERS
RS01218 [RSO - EXCEL] CANNOT ENTER VALUE FOR A TYPE WHEN DOMAIN VALUES OF THIS TYPE ARE DECLARED
RS01227 RULE DATA IS TRUNCATED IN THE EXPLORER RULE TABLE OF DC
RS01230 EXPORT CURRENT PROJECT STATE THROWS ERROR ON EXTENDED PROPERTY WHEN ACTION RULE TEMPLATE IS PRESENT IN THE RULE PROJECT
RS01231 UNABLE TO PUBLISH CHANGES TO DECISION CENTER AS NON ADMIN USER
RS01232 INCORRECT HANDLING OF RULESET PARAMETER/VARIABLE OF COLLECTION TYPE IN RSO
RS01238 INDEX WAS OUTSIDE THE BOUNDS OF ARRAY ERROR WHEN OPENING THE RULEDOC
RS01247 MESSAGES_<LOCALE>.PROPERTIES IS NOT RECOGNIZED BY DECISION CENTER
RS01262 PERIOD CHARACTER IN BRANCH NAMES PREVENTS PUBLISHING RULES TO DECISION CENTER
RS01263 [SSP] UPDATING THE MANAGED XOM'S VERSION PREVENTS FROM RUNNING SUBSEQUENT DVS TEST SUITE
RS01264 RULE PACKAGE STANDARD AND CUSTOM PROPERTIES NOT SYNCHRONIZED
RS01265 RULE PROJECT SYNCHRONIZATION FAILS WHEN RTC SOURCE CODE CONTROL IS USED
RS01268 DC: SECURITY VULNERABILITY CAUSES ANY FILE ON NATIVE OS TO BE DISPLAYED
RS01274 CATEGORIES SELECTION UPDATE NOT REFLECTED IN RTS DECISION TABLE & DECISION TREE EDITOR
RS01275 SYNCHRONIZATION DOES NOT PRESERVE EMPTY CONTENT EVENT RULES
RS01278 DECISION CENTER GENERATE RULESET THAT CONTAIN INVALID RULEFLOW TASKS
RS01279 RTS THREAD STUCK when concurrently synchronizing and creating rules using API

Decision Server Events - Event Runtime
RS01260 CONSOLE IN ADMINISTRATION SECTION OF ADMIN UI DOESN'T DISPLAY WITH SECURITY ON
RS01281 SYNTHETIC EVENT PROCESSING DOESN'T END UP IN CORRECT CONTEXTS

Decision Server Rules - Rule Execution Server
RS01154 EDITING MONITORING OPTIONS REVERTS PROPERTIES UNDER HTDS WSDL OPTIONS TO DEFAULT VALUE
RS01155 HTDS EXECUTION RESPONSE FAILS VALIDATION WHEN A CUSTOM NAMESPACEIS DEFINED IN JAX-B ANNOTATIONS FOR A RULESET PARAMETER CLASS
RS01165 RULESET WITH A PARAMETER DEFINED AS AN ARRAY OF COMPLEX TYPE LEADS TO NULLPOINTEREXCEPTION WHEN RETRIEVING THE WSDL
RS01201 CLASSNOTFOUNDEXCEPTION DURING BYTE CODE GENERATION
RS01254 HTDS: MISSING NAMESPACES AND ATTRIBUTES BASED ON JAVA XOM OBJECTS
RS01285 INCORRECT RTWARN006 WARNING WITH XML REQUEST USING EMPTY NAMESPACE
RS01286 PERFORMANCE REGRESSION OF FASTPATH
RS01292 DVS TESTS FAILS WITH AN EXCEPTION ILRCONVERSIONEXCEPTION
RS01298 NPE WHEN PARSING A DECISION TABLE WITH FASTPATH
RS01302 PROJECT BUILD IN DECISION ENGINE MODE FAILS IF VARIABLES CONTAIN UNDERSCORE IN ITS NAME AND IS IN SUBPACKAGES

Decision Server Events - Event Designer
RS01181 EVENTS SQL EXPRESSION AND MAPPED QUERY ENRICHMENT METHODS DO NOTWORK WITH STORED PROCEDURES IN ORACLE DATABASE
RS01250 VALIDATOR WARNS ABOUT CYCLIC DEPENDENCY WHEN A BUSINESS OBJECT FIELD REFERENCES ANOTHER BUSINESS OBJECT FIELD THROUGH JAVASCRIP
RS01251 OLD NAMES SHOW IN PROJECT XML EXPORT AFTER RENAMING BUSINESS OBJECTS
RS01258 EVENTS SHOULD NOT CONSUMED AND DISCARDED BY WODM EVENTS RUNTIME ENGINES IF THEIR REPOSITORIES ARE NOT CORRECTLY LOADED.
RS01304 MISSING CONTEXT DEFINITION NOT CAUGHT DURING RULE VALIDATION RESULTS IN NPE
RS01305 REMOVING A CONTEXT DEFINITION FROM A RULE CORRUPTS THE CONTEXT DEFINITION ASSET
RS01306 CONTEXT DEFINITION BECOMES CORRUPT WHEN ADDING CONTEXT DEFINITION TO RULES
RS01307 EVENT SELECTION IN CONTEXT DEFINITION EDITOR SHOWED AN EMPTY LIST
RS01308 CHANGING A RULE FROM A SYSTEM CONTEXT TO A CONTEXT DEFINITION SHOWS MANY VALIDATION ERRORS
RS01309 INCORRECT BEER1233E OR BEER1236 VALIDATION MESSAGES

Decision Server Rules - Rule Designer
PM86081 CANNOT GENERATE COPYBOOK DUE TO FAILURE IN IMPORTING COBOL SOURCE
RS01133 INVALID BOM ENTRY NAME NOT BEING REPORTED
RS01142 SYNCHRONIZATION: CONNECTION FROM RULE DESIGNER FAILS WHEN THE USER NAME HAS A '@' CHARACTER
RS01170 RULE DESIGNER CLASSLOADER DOES NOT DECLARE PACKAGES BEFORE CLASSES POTENTIALLY CAUSING STATIC INITIALIZATION ERRORS
RS01193 CREATING A PROJECT FROM RTS FAILS IF A RULE ARTIFACT EDITOR IS OPENED
RS01259 BUILD AUTOMATION TOOL DOES NOT RETURN AN ERROR CODE ON BUILD FAILURE
RS01301 NPE WHEN EXPORTING A RULESET ARCHIVE
RS01313 NPE IN SEMSTATICSEQUENTIALCOMPILER WHEN BUILDING A RULESET WITH THE DECISION ENGINE

Fix Pack (8.0.1.2)

Decision Server Rules - zRule Execution Server
PM91694 ZRES USES STCKF INSTRUCTION WHICH IS NOT SUPPORTED ON OLDER HARDWARE

Operational Decision Management - All
RS01319 WRONG DATE EDITOR SHOWN FOR SIMPLE DATE IN DT
RS01320 WRONG DATE EDITOR SHOWN IN AUTOMATIC MODE DT
RS01333 INCONSISTENT MERGE OF EMPTY DECISION TABLE CELLS
RS01349 THE LOCKING OF COLUMN EXPRESSION IS INCONSISTENT

Decision Server Events - Event Runtime
RS01334 DURABLEEVENTRECEIVERBEAN NOT ALLOWED TO LOOKUP COMP/USERTRANSACTION NOR TO CALL ANY USERTRANSA
RS01356 BEER2736W ERROR WHEN A PACKET WAS RECEIVED THAT CONTAINS MORE THAN ONE EVENT PACKET.

Decision Server Events - Event Designer
RS01346 BEER6738E ERROR WHEN DEPLOYING AN EVENT PROJECT FROM EVENT DESIGNER TO EVENT RUNTIME
RS01352 MULTIPLE ERRORS SEEN WITH IMPORT OF PROJECT FROM CLEARCASE WITH CONTEXT DEFINITIONS
RS01359 BEER1230E REPORTED WHEN A SYNTHETIC EVENT IS REVERTED TO THE SYSTEM CONTEXT
RS01367 TRACK EVENTS NOT GETTING FIRED
RS01406 EVENT DESIGNER CREATED MULTIPLE VERBALIZATION ELEMENTS WHEN EDITING A RULE IN A NEW LOCALE
RS01430 IMPORTED ODM 8.0 XML EVENT PROJECT IN EVENT DESIGNER 8.5 AND THEN PUBLISHED TO DECISION CENTER LEAD TO AN EXCEPTION
RS01447 CLASSCASTEXCEPTION: COM.IBM.WBE.MODEL.ASACTIONFIELD INCOMPATIBLEWITH COM.IBM.WBE.MODEL.ASEVENTFIELD
RS01475 EVENT DESIGNER DOES NOT FORGET PREVIOUS STYLE SHEET SETTINGS AFTER CONNECTOR CONNECTIONS ARE RESET
RS01499 RULE GROUP EDITOR IS NOT DELETING RULE ASSET IN PROJECT MODEL WHEN DELETING A RULE
RS01506 A SINGLE RULE IN A RULE GROUP TURNED INTO A REGULAR RULE AFTER EVENT PROJECT IS EXPORTED AND RE-IMPORTED IN EVENT DESIGNER.
RS01511 SYNTHETIC EVENT MAPPING FIELDS INCORRECTLY
RS01516 AFTER APPLYING ODM V8.0.1.1 FIXPACK, THE PROFILE TEMPLATE FOR EVENTS IS NO LONGER AVAILABLE

Decision Server Rules - Rule Execution Server
RS01313 NPE IN SEMSTATICSEQUENTIALCOMPILER WHEN BUILDING A RULESET WITH THE DECISION ENGINE
RS01344 IS ONE OF TEST LISTING AN EMPTY STRING CAUSES STRINGINDEXOUTOFBOUNDSEXCEPTION
RS01347 DAOEXCEPTION SHOWS DATABASE PASSWORD IN CLEAR
RS01350 HTDS MAY LOOSE SOME PARAMETER VALUES WHEN USING A JAVA XOM
RS01364 DB2 SCRIPT FOR DECISION SERVER CREATES A NON-UNIQUE INDEX
RS01408 ILRXMLDATADRIVER GENERATES A WRONG XML VALUE FOR DECIMAL
RS01418 HELP LINK AND VIEW HTDS DESCRIPTION PAGE NOT ACCESSIBLE FOR RESDEPLOYER AND RESMONITOR
RS01463 ILRDATETIME DOES NOT RESPECT THE SPECIFICATION OF THE W3C
RS01470 JRULES TO .NET USING DATETIME.COMPARETO METHOD DOES NOT RETURN EXPECTED RESULTS
">RS01533 RES CONSOLE ALLOWS CACHING OF SSL CONTENT
">RS01534 XSS VULNERABILITY IN RES CONSOLE THROUGH AUTOSCROLL PARAMETER

Decision Server Rules - Rule Designer
RS01322 RULE ANALYSIS FAILS WITH NULLPOINTEREXCEPTION
RS01331 INCORRECT TYPE IS DISPLAYED IN THE RULE DESIGNER DEBUGGER
RS01340 RULE DESIGNER BUILD MAY PRODUCE RULEFLOW WITH EMPTY BODY
RS01355 RULE DESIGNER STILL SHOWS AN OUTGOING CHANGE AFTER PUBLISHING A PROJECT FILE THAT WAS MOVED INTO A SPECIFIC FOLDER, RENAMED OR D
RS01360 DOMAIN VALUES FOR ARRAY TYPE ARGUMENT CANNOT BE EDITED IN RULE DESIGNER
RS01450 [RD] OUTPUT PARAMETER NOT VISIBLE IN VARIABLES TAB WHEN DEBUGGING DVS EXCEL FILE
RS01479 [RD] RULE PACKAGE REFERENCE IN THE RULE TASK IS NOT REFACTORED
RS01542 Security Update IBM JDK 6 SR 15 FP1

Decision Center
RS01275 SYNCHRONIZATION DOES NOT PRESERVE EMPTY CONTENT EVENT RULES
RS01289 UNABLE TO DIRECTLY EDIT A CELL IN AUTOMATIC MODE DT WHEN THE CONSTRUCT IS SET <A VARIABLE> TO <A VARIABLE> + <A NUMBER>
RS01290 USABILITY ISSUE WITH INTERNET EXPLORER FOR 'VIEW' AND 'NEW FOLDER' ICONS
RS01295 DOMAINS VALUES ARE NOT SORTED ACCORDINGLY IN THE ENTERPRISE CONSOLE DYNAMIC DOMAINS UPDATE VIEW
RS01299 DYNAMIC DOMAINS UPDATE VIEW DOES NOT STAY ON CURRENT PAGE
RS01303 RULEDOCS DON'T INCLUDE RULESET PARAMETERS FROM DEPENDENCY PROJECT
RS01310 [RSO] THE CALENDAR ICON DOES NOT APPEAR IN THE DT EXCEL WHEN EDITING A DATE VALUE
RS01311 CATEGORIES FILTER IS BEING IGNORED IN WEB DT
RS01312 ENCOUNTERED SQL EXCEPTION WHEN APPLYING THE TEAMSERVER SQL SCRIPT GENERATED FROM CUSTOM MODEL EXTENSION
RS01318 RULE PROJECT SYNCHRONIZATION WITH THE ANT TASK DOES NOT USE THE BRANCH PARAMETER
RS01321 PROFILE NAME WITH NON ASCII CHARACTERS SUCH AS JAPANESE/CHINESE CHARACTERS NOT HANDLED PROPERLY IN BUSINESS CONSOLE
RS01323 ANT SYNCHRONIZATION DOES NOT PUBLISH DELETED RULES
RS01324 ERASE PROJECT IN DECISION CENTER FAILS WITH NULLPOINTEREXCEPTION
RS01328 RULEFLOW WITH FORMAT 6.7 PUBLISHED TO DECISION CENTER CANNOT BE OPENED
RS01329 FAILURE TO REMOVE TEMPORARY BASELINES ON DEPENDENT PROJECTS AFTER RULESET GENERATION COMPLETES
RS01337 WRONG HANDLING OF LOCALE CONVERSION FAILURE IN THE BUSINESS CONSOLE
RS01338 WRONG HANDLING OF LOCALE CONVERSION FAILURE IN ENTERPRISE CONSOLE
RS01353 CANNOT SELECT A DEPLOYMENT BASELINE WHEN CREATING TEST SUITE IN DECISION CENTER
RS01354 SYNCHRONIZATION DETECTS OUTPUT FILES WHICH ARE NOT SYNCHRONIZABLE
RS01358 CONTEXT ID DISAPPEARS WHEN EDITING AN EVENT RULE IN DECISON CENTER
RS01361 UNEXPECTED QUERY ERROR UPON PUBLISHED TO DC
RS01362 UNABLE TO WRITE RULE IN INTELLIRULE EDITOR USING INTERNET EXPLORER AND MICROSOFT CHINESE/JAPANESE IME
RS01366 RSO EXCEL RULE DOC CRASHED WITH REPLACE/ REPLACE ALL ACTION
RS01368 SYNCHRONIZATION DOES NOT HANDLE THE REMOVAL OF IMPORTS IN A RULESET FUNCTION
RS01372 [RSO] FILE "SAVE AS" DOES NOT KEEP FILE NAME
RS01373 [RSO] CLEARING A ROW WITH THE DELETE KEY DOES NOT CLEAR THE EDIT BAR
RS01374 VALIDATOR IS NOT USED DURING RULEAPP GENERATION
RS01375 [RSO] SELECTING MULTIPLE DT ROWS LEADS TO TEMPORARY FREEZE
RS01377 BUSINESS CONSOLE CUSTOM VALUE EDITOR OPENS TWICE IN AUTOMATIC MODE
RS01378 DVS RUN FAILS WITH COLLECTION OF ENUM TYPE
RS01379 [DC] THE FOLDER NAME OF THE RULE PROJECT EXPORTED FROM DC ARE IN ENGLISH REGARDLESS OF THE PERSISTENCE LOCALE.
RS01386 CROSS SITE SCRIPTING VULNERABILITY THROUGH BRANCH NAMES
RS01392 VARIABLES MISSING WHEN EDITING RULES IN DECISION CENTER
RS01394 [DC] DECISION TABLE INCORRECTLY DISPLAYED IN BUSINESS/ENTERPRISE CONSOLE
RS01399 [RSO] DELETION OF MULTIPLE DT ROWS LEADS TO TEMPORARY FREEZE
RS01400 SUBFLOW TASK UUID NOT CONVERTED DURING SYNCHRONIZATION
RS01405 [DC] ERROR WHEN EXPORTING A RULE PROJECT THAT CONTAINS DT TEMPLATE
RS01417 [DC]DEPLOYMENT BASELINE FROM 7.0 REPOSITORY HAS NOT MIGRATED PROPERLY TO 8.0 AND 8.5.
RS01421 [DC]SQLEXCEPTION ON DERBY DATABASE WHEN GENERATING A RULEAPP
RS01423 SUB-PACKAGES ADDED IN A BRANCH MAY NOT BE INCLUDED IN RULEFLOW IRL WHEN BUILDING THE RULESET
RS01425 SECURITY SETTINGS IS NOT MIGRATED FROM 7.0/7.1 TO 7.5, 8.0 AND 8.5
RS01429 GENERATED DT HTML STRING CONTAINS INCORRECT FORMAT
RS01434 [DC]RUNNING MIGRATION SCRIPT THROWS ENDV FOREIGN KEY VIOLATION ERRORS.
RS01452 RULESET & ADVANCED PROPERTIES ARE NOT SYNCHRONIZED TO DECISION CENTER
RS01453 [DC] VERTICAL SCROLLBAR IS NOT ENABLED IN CATEGORY SELECTOR
RS01454 DVS EXCEL FILE WITH OUTPUT VALUES TAKES A LONG TIME TO GET GENERATED
RS01455 IMPOSSIBLE TO RE-DEPLOY A RULEAPP WITH MORE THAN ONE RULESET FROM RULE TEAM SERVER
RS01458 DECISION CENTER USER PASSWORD MAY APPEAR IN SERVER LOG
RS01464 PERFORMANCE ISSUE ON FIRST CONNECTION AFTER DC REPOSITORY MIGRATION
RS01465 MIGRATION SCRIPT MAY FAIL WITH BASELINECONTENT FOREIGN KEY VIOLATION.
RS01469 DB2 SQL EXCEPTION DURING RULE SYNCHRONIZATION
RS01471 [DC] CHECK UUID WARNINGS IN DIAGNOSTIC DUE TO RULE ACTIFACT RECORDS NOT DELETED FROM BRSTUDIO TABLE
RS01472 DECISION CENTER QUERY DOES NOT RETURN A RULEFLOW WHICH DIRECTLY SELECTS A DECISION TABLE IN THE SCOPE OF ONE OF ITS TASKS
RS01473 [DC] RULEFLOW IS NOT CORRECTLY DISPLAY IF DC USES A DIFFERENT LOCALE
RS01474 MISSING SECURE ATTRIBUTE IN ENCRYPTED SESSION (SSL) COOKIE FOR TEAMSERVER_DATASOURCE
RS01476 [DC] WEB COMPONENT VARIABLE LOCALEDIR IS NOT DEFINED
RS01485 PERFORMANCE ISSUE WITH MIGRATION SCRIPT WHEN HANDLING ELEMENTS VERSIONS
RS01488 CANNOT OPEN EXPLORE TAB BECAUSE OF PERFORMANCE ISSUE WITH A LARGE REPOSITORY
RS01496 DVS TEST COMPARISON MAY FAIL FOR DATES THAT ARE EQUAL PRIOR TO 1911 IN FRENCH TIMEZONE
RS01498 UNABLE TO LOGIN AGAIN IN DECISION CENTER BUSINESS WHEN THE PERMISSION ON THE LAST BRANCH USED HAVE CHANGED
RS01502 NPE WHEN DEPLOYING AN EVENT PROJECT WITH A BASELINE
RS01508 [EC] UNABLE TO COPY A SMART FOLDER
RS01512 [DC]PERFORMANCE REGRESSION BETWEEN 7.1 AND UPPER RELEASES
RS01520 QUERY IN DC DOES NOT FIND A RULEFLOW SELECTING A DT WITH A NAME CONTAINING A SPECIAL CHARACTER
RS01521 TOOLTIP FOR CATEGORY PROPERTY FIELD IN DECISION CENTER SHOWS UNEXPECTED HTML TAG WHEN THERE IS MORE THAN ONE CATEGORY
RS01529 PERFORMANCE ISSUE BROWSING A SUB-BRANCH COMPARED TO THE MAIN BRANCH
RS01535 INCORRECT RULESET UPON REDEPLOY OF RULEAPP FROM DECISION CENTER
RS01536 ILRCANNOTDELETEEXCEPTION WHEN TRYING TO DELETE A SUB-BRANCH
RS01538 SOME QUERIES ARE NOT PROPERLY TRANSLATED TO SQL
RS01539 NEW RULE PROJECT FROM DECISION CENTER DROP-DOWN LISTS ALL RULE PROJECT REGARDLESS OF USER PERMISSIONS
RS01543 UNABLE TO SAVE CHANGES TO THE EXTRACTOR FOR A RULESET WITH DEPLOYMENT BASELINES

Fix Pack 1 (8.0.1.1)

Decision Server Rules - Rule Execution Server for z/OS
PM82378 NON ZERO JVM RETURN CODES FROM ZRES ARE BEING OVERWRITTEN

Operational Decision Management - All
RS01206 PRODUCT INSTALLER DOES NOT INCLUDE THE .ECLIPSEPRODUCT FILE WHEN INSTALLING ECLIPSE FOR RULE DESIGNER.
RS01252 EXCEPTION IS GENERATED WHEN INSTALLING ODM RULES ARTIFACT WITHOUT WAS PREREQUISITE TO USE WITH WEBLOGIC

Decision Center
PM76847 DECISION CENTER LIST OF GRANTS IN JOB HBRDCGRN IS INCOMPLETE
RS01098 DVS REPORTS DISPLAY INCORRECT EXPECTED AND OBSERVED VALUES WHEN TESTING A COLLECTION OF COMPLEX OBJECTS WITH VIRTUAL ATTRIBUTES
RS01146 DYNAMIC PRIORITIES NOT PUBLISHED TO DECISION CENTER
RS01157 DVS TEST RAISES ILRBOMTYPENOTFOUNDEXCEPTION WHEN THE RULESET HASNO BOM
RS01158 DOMAIN NAMES TRUNCATED IN DVS EXCEL SCENARIO SUITES
RS01161 DECISION CENTER: PERMISSION VIEW ONLY IS NOT PROPAGATED TO EDIT-IN-WORD BUTTON
RS01166 RSO REPORTS "INCOMPLETE ACTION" ERROR WHEN THERE IS A DEFAULT VALUE IN DT ACTION DEFINITION
RS01172 CANNOT PUBLISH A NEW BOM ENTRY INTO A BRANCH IN DECISION CENTER
RS01184 DEFAULT VALUES ARE NOT DISPLAYED IN THE RULEDOC CELL WHEN A DT IS PUBLISHED FROM DECISION CENTER TO RSO
RS01190 FROZEN CONDITIONS FROM A RULE TEMPLATE CAN BE MODIFIED IN A RULE
RS01193 CREATING A PROJECT FROM RTS FAILS IF A RULE ARTIFACT EDITOR IS OPENED
RS01198 PERFORMANCE ISSUE WHEN USING RULEDOCS
RS01205 MANAGE SERVERS PAGE CAN ONLY SHOW FIRST 10 SERVERS
RS01218 [RSO - EXCEL] CANNOT ENTER VALUE FOR A TYPE WHEN DOMAIN VALUES OF THIS TYPE ARE DECLARED
RS01227 RULE DATA IS TRUNCATED IN THE EXPLORER RULE TABLE OF DC
RS01230 EXPORT CURRENT PROJECT STATE THROWS ERROR ON EXTENDED PROPERTY WHEN ACTION RULE TEMPLATE IS PRESENT IN THE RULE PROJECT
RS01231 UNABLE TO PUBLISH CHANGES TO DECISION CENTER AS NON ADMIN USER
RS01232 INCORRECT HANDLING OF RULESET PARAMETER/VARIABLE OF COLLECTION TYPE IN RSO
RS01235 COMMA SEPARATOR FOR COLLECTION ITEMS IS NOT PARSED CORRECTLY IN DT FRENCH LOCALE
RS01238 INDEX WAS OUTSIDE THE BOUNDS OF ARRAY ERROR WHEN OPENING THE RULEDOC
RS01247 MESSAGES_<LOCALE>.PROPERTIES IS NOT RECOGNIZED BY DECISION CENTER
RS01262 PERIOD CHARACTER IN BRANCH NAMES PREVENTS PUBLISHING RULES TO DECISION CENTER
RS01263 [SSP] UPDATING THE MANAGED XOM'S VERSION PREVENTS FROM RUNNING SUBSEQUENT DVS TEST SUITE
RS01264 RULE PACKAGE STANDARD AND CUSTOM PROPERTIES NOT SYNCHRONIZED
RS01265 RULE PROJECT SYNCHRONIZATION FAILS WHEN RTC SOURCE CODE CONTROL IS USED
RS01268 DC: SECURITY VULNERABILITY CAUSES ANY FILE ON NATIVE OS TO BE DISPLAYED
RS01274 CATEGORIES SELECTION UPDATE NOT REFLECTED IN RTS DECISION TABLE & DECISION TREE EDITOR
RS01278 DECISION CENTER GENERATE RULESET THAT CONTAIN INVALID RULEFLOW TASKS
RS01279 RTS THREAD STUCK when concurrently synchronizing and creating rules using API
RS01297 UNABLE TO TEST CONNECTION TO THE EVENT SERVER FROM DC
RS01300 TEST CONNECTION TO DECISION SERVER FROM DECISION CENTER FAILS WHEN THE URL ENDS WITH /

Decision Server Rules - Rule Execution Server
RS01155 HTDS EXECUTION RESPONSE FAILS VALIDATION WHEN A CUSTOM NAMESPACEIS DEFINED IN JAX-B ANNOTATIONS FOR A RULESET PARAMETER CLASS
RS01201 CLASSNOTFOUNDEXCEPTION DURING BYTE CODE GENERATION
RS01254 HTDS: MISSING NAMESPACES AND ATTRIBUTES BASED ON JAVA XOM OBJECTS
RS01285 INCORRECT RTWARN006 WARNING WITH XML REQUEST USING EMPTY NAMESPACE
RS01286 PERFORMANCE REGRESSION OF FASTPATH
RS01292 DVS TESTS FAILS WITH AN EXCEPTION ILRCONVERSIONEXCEPTION
RS01298 NPE WHEN PARSING A DECISION TABLE WITH FASTPATH
RS01302 PROJECT BUILD IN DECISION ENGINE MODE FAILS IF VARIABLES CONTAIN UNDERSCORE IN ITS NAME AND IS IN SUBPACKAGES

Decision Server Events- Event Runtime
RS01258 EVENTS SHOULD NOT CONSUMED AND DISCARDED BY WODM EVENTS RUNTIME ENGINES IF THEIR REPOSITORIES ARE NOT CORRECTLY LOADED.
RS01260 CONSOLE IN ADMINISTRATION SECTION OF ADMIN UI DOESN'T DISPLAY WITH SECURITY ON
RS01281 SYNTHETIC EVENT PROCESSING DOESN'T END UP IN CORRECT CONTEXTS
RS01309 INCORRECT BEER1233E OR BEER1236 VALIDATION MESSAGES

Decision Server Rules - Rule Designer
PM86081 CANNOT GENERATE COPYBOOK DUE TO FAILURE IN IMPORTING COBOL SOURCE
RS01170 RULE DESIGNER CLASSLOADER DOES NOT DECLARE PACKAGES BEFORE CLASSES POTENTIALLY CAUSING STATIC INITIALIZATION ERRORS
RS01241 PERFORMANCE REGRESSION OF RULE ANALYSIS
RS01259 BUILD AUTOMATION TOOL DOES NOT RETURN AN ERROR CODE ON BUILD FAILURE
RS01301 NPE WHEN EXPORTING A RULESET ARCHIVE
RS01313 NPE IN SEMSTATICSEQUENTIALCOMPILER WHEN BUILDING A RULESET WITH THE DECISION ENGINE

Decision Server Rules - Scorecard Modeler
RS01315 SCORECARD :ROUNDING ERROR IMPACT SCORE CALCULATION

Decision Server Events- Event Designer
RS01181 EVENTS SQL EXPRESSION AND MAPPED QUERY ENRICHMENT METHODS DO NOTWORK WITH STORED PROCEDURES IN ORACLE DATABASE
RS01250 VALIDATOR WARNS ABOUT CYCLIC DEPENDENCY WHEN A BUSINESS OBJECT FIELD REFERENCES ANOTHER BUSINESS OBJECT FIELD THROUGH JAVASCRIP
RS01251 OLD NAMES SHOW IN PROJECT XML EXPORT AFTER RENAMING BUSINESS OBJECTS
RS01304 MISSING CONTEXT DEFINITION NOT CAUGHT DURING RULE VALIDATION RESULTS IN NPE
RS01305 REMOVING A CONTEXT DEFINITION FROM A RULE CORRUPTS THE CONTEXT DEFINITION ASSET
RS01306 CONTEXT DEFINITION BECOMES CORRUPT WHEN ADDING CONTEXT DEFINITION TO RULES
RS01307 EVENT SELECTION IN CONTEXT DEFINITION EDITOR SHOWED AN EMPTY LIST
RS01308 CHANGING A RULE FROM A SYSTEM CONTEXT TO A CONTEXT DEFINITION SHOWS MANY VALIDATION ERRORS
RS01314 UNABLE TO DEFINE EVENT OBJECT TO HOLD RESULTS OF JDBC SELECT ACTION
RS01325 DUPLICATE FOLDER SHOWING AFTER IMPORTING EXISTING EVENT PROJECT
RS01326 IMPROPER HANDLING OF READ ONLY FILES IN EVENT DESIGNER
RS01327 INVALID THREAD ACCESS WHEN BUILDING PROJECT WITH READ ONLY FILES

Mod Pack (8.0.1)

Decision Server Rules - Rule Designer
RS01015 Rule Designer processes empty lines of Excel sheet when creating a domain
RS01067 DVS Excel files no longer work after using RTC

Operational Decision Management - All
RS01053 String values truncated in DT when using a decorated value descriptor
RS01077 Unable to install BusinessSpace/WDS/WDC on AS/400: Platform support validation error
RS01097 PMT Template failed to check the datasource
RS01119 Launchpad stand-alone server installation may fail during the creation of the server profile when MS SQL Server is selected as a database provider

Decision Center
RS01024 In RTS/DC, surrounding a decision table or decision tree condition with parentheses leads to NullPointerException
RS01054 In a ruleflow, branch node labels cannot contain special characters such as ">=" for use in Decision Center
RS01057 XSD XOM changed not detected at synchronization
RS01071 IlrDeploymentFacility.deployEventProject password match fails
RS01089 Unable to synchronize with ruledocs published to an Apache WebDAV location
RS01090 Publishing rules to webdav location is stuck at 84%
RS01092 RSO: "null" added to the end of DT in Excel for empty condition
RS01096 Check in fails in RSO when using an SSL connection
RS01106 DT action column fomat not shown in business console when viewing the DT
RS01114 [RSO] When upgrading to new version of Word or Excel addin, the user settings for these addins could be read - Error message in a window.
RS01115 [RSO Excel] Pasting multiple copied cells from a worksheet (835 rows with 8 columns) only paste the values on the first columns
RS01116 DT display dot as separator instead of comma for decimal values in RTS when persistence locale is fr_FR
RS01122 Incorrect copy/paste of DT action cell content
RS01125 Cannot publish empty ruleflow from Decision Center to Ruledoc
RS01126 Comma is removed from number with 3 decimal digits or more in french locale
RS01127 Loss of rule project name translation on Decision Center banner
RS01130 [RSO - Excel] Domain values parseable by number types are interpetred by Excel - The value '01' becomes '1' intepreted
RS01140 Completeness generation report shows an exception when setting security
RS01144 Rule order in a folder defined in Rule Designer is not published to DC
RS01149 Operators are displayed as values when editing a decision table in RSO

Decision Server Rules - Event Designer
IV29270 CWSOM1018E ERRORS WHEN STARTING THE EVENT PAYLOAD STORE
RS01042 Prompt for Event server credentials during deployment is not implemented in Decision Center
RS01094 Rules referencing input events as parameters could not be deployed
RS01094 ERROR BEER1307E IS THROWN ON THE EVENT RULE WHEN TRIGGERING EVENT IS REFERENCED AS PARAMETER IN ACTION
RS01099 BUSINESS RULE DATA CONNECTION WIZARD FAILS ON DOMAIN 0,1 MEMBERS
RS01150 INVALID BEAN STATE EXCEPTION WHEN RETRIEVING DATA FROM SQL

Decision Server Rules - Rule Execution Server
RS01016 Ruleflow IRL Syntax check ignores missing closing brace "}"
RS01021 DVS test on collection fails when the name of the constructor's argument does not match the name of the corresponding attribute
RS01022 [XU] No exception logged when a XU interaction fail
RS01065 Decision Warehouse report do not display ruleset parameters values when execution events trace have been filtered
RS01066 Bound Objects info not recorded in the execution trace
RS01101 "Cannot find value in execution trace" with test suite when business rules contain "&" in the name
RS01103 rules using condition "is one of" are not always executed in Fastpath
RS01104 IlrComparisonException with optional columns all empty
RS01111 import are removed from schema included in WSDL generated by HTDS
RS01113 Encountered INVALID_CHARACTER_ERR during BOM serialization
RS01137 Ruleset parsing failed on Sequential
RS01143 NPE DURING RULESET PARSING USING FASTPATH OR SEQUENTIAL ALGORITHM IF A RULE IS USING LIST OF ENUMS
RS01153 NPE on each call using HTDS after an exception during a bad request call

Fix Pack (8.0.0.1)

Decision Server Rules - zRule Execution Server
PM59969 JETTY HASHTABLE DENIAL OF SERVICE
PM69591 Incorrect installation script on WBE for zOS

Decision Server Rules - Rule Execution Server
RS01011 NullPointerException in IlrCollectBetaMem
RS01000 HTDS does not generate the correct WSDL when the schemas create a cycle
RS01003 HTDS cannot generate a WSDL when the same namespace is used in multiple imports
RS01004 [DVS] An empty object in a flat Excel scenario causes subsequent objects to be null
RS01018 Excel scenario generation time grows exponentially with the number of BOM elements
RS01027 Excel scenario template does not display domain dropdown on the only attribute of the input parameter
RS01030 ClassCastException when initializing an array of XML-bound objects within a function in sequential mode
RS01031 When performing concurrent execution of scenario suites based on the Excel scenario suite format from RTS, executions sometimes fails with a "java.lang.NumberFormatException: multiple points" exception
RS01055 DVS error: Cannot resolve symbol arrayContains, error code: GBRXU0014E
RS01056 Unable to access input parameters from HTDS interceptor
RS01058 Integer parameter BOM serialization does not work (used in DVS)

Decision Server Rules - Rule Designer
RS01026 Build automation sometimes tries to access the rule project before the project is completely registered in the in-memory model
RS01040 IBM ECLIPSE HELP SYSTEM SECURITY VULNERABILITIES
RS01069 COBOL code generation - generated cobol program line is more than 72 column for DBCS characters

Decision Server Events - Event Designer
RS01019 Using an accumulating array in JavaScript does not work
RS01081 Mapped expression entered in Role of the field panel is not saved
RS01082 The "Notifying Event model listeners" job keeps interrupting the eclipse AutoBuildJob job responsible for automatic workspace build
RS01083 Data Connection selection in Business Object Field editor while using Enriched by Expression definition type does not save
RS01084 New Events/Rules integration doesn't work on z/OS
RS01085 Unable to import project into Event Designer

Operational Decision Management - All
RS01086 WODM is not using the schema name specified

Decision Center
RS00985 incorrect installation for DB2 zOS
RS01008 Redeploying a ruleapp with an IRL function generates an invalid file
RS01023 dynamic xom published with incorrect file encoding
RS01028 cannot move cursor with keyboard left/right arrows in filter editor with IE 8
RS01029 item selected by mouse will be positioned as the first item in the drop down
RS01037 Decision Center : Events: Cannot reference Events from dependent projects
RS01039 Extended Rule model is not supported for Template on Decision Center
RS01051 Missing rule(S) when displaying rules by Name in Business Console
RS01052 Guided editor: Incorrect selection of BOM method when verbalizations are truncated
RS01062 Display issue with the blue band with IE8, in Decision Center
RS01072 Decision Center: RSO Edition button does not work after Edition is started
RS01088 [RSO EXCEL] Copy / paste of multiple cells on the same rows doesn't work with french regional settings

Release 8.0 (8.0.0.0)

Operational Decision Management - All
RS00898 Duplicated values displayed for Java Enum member in the "select a choice" dropdown in guided editor

Decision Server Rules - Rule Execution Server
RS00842 jrules-res-session-was7.jar is still referenced in the documentation
RS00970 PMT does not copy jrules-mbean-descriptors.jar when creating profile for WODM Decision Server Rules

Decision Server Rules - Rule Designer
RS00990 DT data value not migrated if the type is String and using the method doesNotEquals

Decision Center
RS00949 RTS DT editor: Replacing previously entered parameter value with default value for a DT column results in incomplete IRL generation
RS00992 Quick Edit is broken on FF5+ and IE8

Fix Pack 4 (7.5.0.4)

This fix pack delivers Operational Decision Manager 7.5.0.3 with an updated IBM JDK 6 SR13.
The details can be found in the bulletin regarding APAR RS01283


Fix Pack 3 (7.5.0.3)

Decision Server Rules - Event Designer
RS01042 Prompt for Event server credentials during deployment is not implemented in Decision Center
RS01094 ERROR BEER1307E IS THROWN ON THE EVENT RULE WHEN TRIGGERING EVENT IS REFERENCED AS PARAMETER IN ACTION

Decision Server Rules - Event Runtime
IV29270 CWSOM1018E ERRORS WHEN STARTING THE EVENT PAYLOAD STORE
IV31288 RUNTIME CAN BECOME HUNG WHEN SYNTHETIC EVENTS USE A DIFFERENT CONTEXT ID

Decision Server Rules - Rule Designer
RS01015 Rule Designer processes empty lines of Excel sheet when creating a domain
RS01067 DVS Excel files no longer work after using RTC
RS01069 COBOL code generation - generated cobol program line is more than 72 column for DBCS characters
RS01124 NullPointerException when generating COBOL code
RS01138 generated COBOL comment lines with DBCS characters are not formatted properly

Decision Server Rules - Rule Execution Server
RS00979 BigInteger division refers to missing java,math.BigInteger.divideInternal method
RS01011 NullPointerException in IlrCollectBetaMem
RS01016 Ruleflow IRL Syntax check ignores missing closing brace "}"
RS01018 Excel scenario generation time grows exponentially with the number of BOM elements
RS01021 DVS test on collection fails when the name of the constructor's argument does not match the name of the corresponding attribute
RS01022 [XU] No exception logged when a XU interaction fail
RS01027 Excel scenario template does not display domain dropdown on the only attribute of the input parameter
RS01030 ClassCastException when initializing an array of XML-bound objects within a function in sequential mode
RS01031 When performing concurrent execution of scenario suites based on the Excel scenario suite format from RTS, executions sometimes fails with a "java.lang.NumberFormatException: multiple points" exception
RS01055 DVS error: Cannot resolve symbol arrayContains, error code: GBRXU0014E
RS01056 Unable to access input parameters from HTDS interceptor
RS01058 Integer parameter BOM serialization does not work (used in DVS)
RS01066 Bound Objects info not recorded in the execution trace
RS01103 rules using condition "is one of" are not always executed in Fastpath
RS01104 IlrComparisonException with optional columns all empty
RS01111 import are removed from schema included in WSDL generated by HTDS
RS01113 Encountered INVALID_CHARACTER_ERR during BOM serialization
RS01137 Ruleset parsing failed on Sequential
RS01143 NPE DURING RULESET PARSING USING FASTPATH OR SEQUENTIAL ALGORITHM IF A RULE IS USING LIST OF ENUMS
RS01154 Editing monitoring options reverts properties under HTDS WSDL options to default value

Decision Center
RS01004 [DVS] An empty object in a flat Excel scenario causes subsequent objects to be null
RS01023 dynamic xom published with incorrect file encoding
RS01028 cannot move cursor with keyboard left/right arrows in filter editor with IE 8
RS01029 item selected by mouse will be positioned as the first item in the drop down
RS01037 Decision Center : Events: Cannot reference Events from dependent projects
RS01039 Extended Rule model is not supported for Template on Decision Center
RS01044 Event project deployment baseline creation requires ConfigManager role
RS01052 Guided editor: Incorrect selection of BOM method when verbalizations are truncated
RS01054 In a ruleflow, branch node labels cannot contain special characters such as ">=" for use in Decision Center
RS01057 XSD XOM changed not detected at synchronization
RS01062 Display issue with the blue band with IE8, in Decision Center
RS01072 Decision Center: RSO Edition button does not work after Edition is started
RS01075 Connecting to Decision Center fails for a project created by copying from another project in Rule Designer
RS01088 [RSO EXCEL] Copy / paste of multiple cells on the same rows doesn't work with french regional settings
RS01089 Unable to synchronize with ruledocs published to an Apache WebDAV location
RS01090 Publishing rules to webdav location is stuck at 84%
RS01092 RSO: "null" added to the end of DT in Excel for empty condition
RS01096 Check in fails in RSO when using an SSL connection
RS01098 DVS: HTML and Excel reports un-correctly display expected and observed values when testing on a collection of complex objects with virtual attributes
RS01114 [RSO] When upgrading to new version of Word or Excel addin, the user settings for these addins could be read - Error message in a window.
RS01115 [RSO Excel] Pasting multiple copied cells from a worksheet (835 rows with 8 columns) only paste the values on the first columns
RS01116 DT display dot as separator instead of comma for decimal values in RTS when persistence locale is fr_FR
RS01126 Comma is removed from number with 3 decimal digits or more in french locale
RS01130 [RSO - Excel] Domain values parseable by number types are interpetred by Excel - The value '01' becomes '1' intepreted
RS01140 Completeness generation report shows an exception when setting security
RS01141 Rule synchronization failed with an new set of Status property values
RS01142 Synchronization: connection from Rule Designer fails when the user name has a '@' character
RS01144 Rule order in a folder defined in Rule Designer is not published to DC
RS01146 Dynamic priorities not published to Decision Center
RS01161 Decision Center: Permission view only is not propagated to Edit-in-Word button
RS01162 Excel scenario suite flat mode: java.lang.IllegalArgumentException in ilog.rules.dvs.excel.impl.IlrDefaultExcel2003InlinedTypeManager.deserializeInlinedObject when the first value in a column is defined but the following are not.
RS01175 NullPointerException when editing the dependencies of a secure project in Decision Center

Fix Pack (7.5.0.2)

Decision Server - Rule Execution Server
RS00838 Long parsing time using Sequential or Fastpath and numerous bindings
RS00847 ClassCastException when calling a method with vararg argument in sequential mode
RS00858 Fastpath misses rule with open interval
RS00876 MDB connectionID in response message is not of String type
RS01000 HTDS does not generate the correct WSDL when the schemas create a cycle
RS01003 HTDS cannot generate a WSDL when the same namespace is used in m ultiple imports

Decision Server - Rule Designer
RS00826 Annotations are ignored during BOM creation and BOM update
RS00831 hiddenType class property is not editable in BOM editor
RS00832 BOM class marked as hiddenType is filtered out from superclass choice list
RS00839 RoC: italian Verbalizer fails to create plural Vocabulary
RS00866 Rule elements order is incorrect in index.xml of ruleset archive when RS extractor is used
RS00872 a class is deleted in BOM editor while editing another
RS00911 Incorrect check of duplicate artifact paths in rule project dependency graph
RS00943 Priority property name is not localized in Rule Designer using the Japanese locale
RS00950 BOM update displaying a lot of messages with xsd xom
RS00957 "AssertionFailedException: null argument" error when debugging a method with a virtual argument

Decision Server - Event Designer
RS00867 Exercise 1 building a simple application fails in non us locale
RS00870 Cannot open event runtimes view
RS00880 Event designer event field constructor doesn't work properly sometimes
RS00882 Data connection may cause oom in event designer
RS00883 V6.2 schema file for event project is not generated
RS00884 Event designer event object editor failed to list some assets imported from a 7011 project
RS00885 WSDL import fails in event designer if the WSDL references a schema file using relative path
RS00896 Error deploying event rules using the operator is one of
RS00900 Derived asset sync builder can crash with a ConcurrentModificationException
RS00978 the error occurs when the event rule contains after/before duration
RS00999 Parsing error when the event rule contains a or type

Decision Server - Event Runtime
IV12060 Performance degradation if a mapped key is not found
IV12186 wbe runtime fails to perform an implicit cast from a sql date to a datetime, properly
RS00890 Non-persistent csio not storing with a large number of con ids
RS00904 Unable to use mapped keys to retrieve data from data connections
RS00909 Unable to prune steps table entries due to long lived content ids causing performance and scalability issues
RS00988 Opening the event runtime console triggers unexpected processing

Operational Decision Management - All
RS00801 Project Update does not synchronize properly for a rule moved to a package created in RTS
RS00825 [Web DT] Web decision table editor move rows pagination backward if a column header is selected
RS00852 [WebDT] Invalid HTML layout when using paging and empty cell row accross two pages
RS00875 Rule project publish failed when a dynamic XOM is added from an external source
RS00889 Custom properties not synchronized between Rule Designer and Decision Center
RS00894 [Rules for COBOL] Code generation error when optimizing embeded mapped method call
RS00899 gettingstarted miniloan server build script fails
RS00903 bql_it.voc is not encoded in utf-8 format
RS00927 Default implementation of TableModel use in the JSF table web component may behave unexpectedly
RS00939 NoClassDefFoundError synchronizing rule project with the Decision Center Ant task
RS00940 Properties of technical rules not synchronized between Rule Designer and Decision Center
RS00962 Tests on domain values and GregorianCalendar inside collections and arrays return incorrect values
RS00974 Rule elements are not updated correctly during synchronization from DC
RS00976 Cells cannot be merged when condtion column definition uses "at least <a number>"
RS00979 BigDecimal divisions in BAL rules do not behave correctly.

Decision Center
RS00782 Categories are not sorted alphabetically in the rule editor in RTS
RS00815 No error reported during ruleset extraction if Decision Table uses BOM elements not in baseline
RS00824 JavaScript error when writing a query on rule templates in RTS
RS00845 RTS does not deploy ruleapp after omitting erroneous rules
RS00848 Nil pointer exception running DVS test suite
RS00851 script action.jsp introduces a security vunerability in RTS
RS00853 ArrayIndexOutOfBoundsException when using arrow key at the bottom of a decision table in quick edit mode
RS00878 Invalid redeployment if a package in a ruleflow is renamed.
RS00888 Missing .xom files when generating a ruleset archive from decision center
RS00895 Missing RSO section in Decision Center's Project Tab
RS00913 Could not synchronize with Decision Center when connection URL is ending with "/"
RS00928 Incorrect Japanese characters in Excel DVS report
RS00941 Decision Center ruleflow scope links for packages fail to take user to package of another project
RS00948 NullPointerException when displaying a business object which members are not all verbalized
RS00961 Problems with tests with BigDecimal and with decimal precision
RS00963 Bad support of decimal values in non-English locales
RS00987 RSO: Error GBROC0014E while opening Ruleflow in RuleDoc

Release 7.5 Fix Pack 1 (7.5.0.1)

Decision Server - Rule Execution Server
RS00788 [XU] Deadlock when ruleset cache monitoring is enabled

Decision Center
RS00709 RTS to RSO: Interval brackets are not properly exported on publication
RS00798 RTS list of RuleApps cannot be properly sorted by date
RS00802 Rule modification lost after saving when user edits twice the same rule in the same browser
RS00810 Vulnerability with unknown error cause

Decision Server - Rule Designer
RS00747 Duplicate rule packages when selecting rules for a ruleflow task if subpackage of same name in referenced project
RS00814 BOM entries with conflicting names are not detected

Operational Decision Management - All
RS00806 Incorrect BOM serialization with DVS execution data
RS00828 [RSO - Excel] Invalid DT document saved with the Excel Addin when there are default values for the place holders in the actions.

Release 7,5 (7.5.0.0)

Decision Server - Rule Execution Server
RS00212 RES console throws error from the Decision Warehouse tab if there is no DB persistence setup for it
RS00245 A heavy load of ruleset execution requests using POJO rulesessions can cause a NPE
RS00257 Doc omits to mention that when the RES is invoked remotely and XOM objects are not all serializable the user needs to exclude the objects bound by the fired rules from the execution trace
RS00288 [XU] NPE in event dispatcher on AIX
RS00308 InterceptorClassNameUsed is null in the session response
RS00338 The request submitted to HTDS is corrupted
RS00462 Incorrect WSDL is generated when a schema is included with a relative path
RS00481 CLONE -[XU] IlrCCIClientFactory depends on XU classes which are not in the CCI package
RS00535 Installation doc for RES on WebSphere asks to map both the admin group & user to the Monitor role while only mapping the group is sufficient
RS00549 [RES Console] diagnostic does not close the connection used to execute the ruleset
RS00553 incorrect XU memory profiler installation documentation
RS00625 RES deployer in Studio does not take into account hosts excluded from http proxing set by Eclipse Network Connection preference option
RS00631 Namespace prefixes need to be used in the generated response XML of the transparent decision service
RS00635 cannot change console persistence with res-setup ant task
RS00671 HTDS excessive memory consumption when building SOAP response
RS00725 HTDS returns an "200 OK" HTTP code even when a SOAP fault is generated
RS00726 HTDS call fails with v7113 compatibility mode when the ruleset has no parameters

Decision Server - Rule Designer
RS00192 Impossible to get rid of the build errors until restarting the workspace
RS00201 Rules properties lost after french migration (Tags, template, priority and documentation) from V5.x to V7.x
RS00205 In Rule Studio, while adding custom properties, values appear as null and are not ordered correctly
RS00206 Element is still present in B2X file after being removed from the XSD XOM
RS00207 B2X errors not shown in Problems view of Rule Studio, if source schema changed for XML class
RS00237 BOM class with an explicit execution name mapping to the same XOM class are excluded from BOM update
RS00238 Bom update for class members never applies if a domain on the member type is missing
RS00239 ArrayIndexOutOfBoundsException when adding an XSD with an invalid URL namespace to a rule project's dynamic XOM
RS00249 Query ruleflow with <may select> caused internal compilation error
RS00300 "Eclipse launcher plugin is not available in the workspace" when importing the default Excel formats in DVS Project
RS00307 [RS4J] Performance issues when collecting UUID's on big Vocabularies, BOM and B2X
RS00319 A BOM attribute's cardinality can't be edited within the BOM editor
RS00353 Automation Builder does not detect all changes on Incremental build
RS00363 PMR 24889,004,000 : Vector content not visible in variables view
RS00371 BOM Update should display an error panel when an exception is thrown during XOM class loading
RS00387 Ruleflow IRL is not generated if a new package is added to a parent package present in a ruletask
RS00402 Issues with Linked Trees in BOM update view
RS00404 Incorrect automatic de-selection of selected BOM/XOM elements after BOM update
RS00405 An extractor with no name prevents rule synchronization with RTS
RS00512 Rule Studio : WebService Wizzard does not support multibyte encoding
RS00551 Ruleapp deployment errors in Rule Studio shown in uncloseable pop-up dialog, which extends outside the screen
RS00585 .xom file is not generated when exporting a ruleset from Rule Studio
RS00624 Float suffix added to the initial value of a variable declared in variableset of type double
RS00627 JViews license check invoked before license registration within reporting plugin
RS00666 deleting a condition column may remove rows that should be kept
RS00677 Restrictions on variable set name serve no purpose
RS00677 Restrictions on variable set name serve no purpose
RS00684 Display of Array checkbox when setting type of ruleset parameter
RS00688 Dynamic XOM referenced through the include directive do not trigger a build when modified
RS00688 Dynamic XOM referenced through the include directive do not trigger a build when modified
RS00688 dynamic xom is not always reloaded when necessary
RS00691 RuleStudio: Regression: Cannot Copy from Excel String with a quote
RS00710 incorrect migration of decision table when column has default value
RS00729 InvocationTargetException when generating an Excel Scenario File template
RS00729 InvocationTargetException when generating an Excel Scenario File template
RS00742 COBOL code generation behaves differently for rules and DT
RS00754 NPE when run ruleproject with variable defined in variable set not located in root folder

Operational Decision Management - All
RS00086 Parsing error when mapping non generics arguments to a generic method
RS00100 Decision table build takes too much resources when addiotnal quotes are added to the cell in the inline editor
RS00109 DecisionTree: overlaps between labels in horizontal view
RS00167 issue with using hashers
RS00171 Empty decision table leads to incorrect ruleset generation
RS00184 Badly generated Decision table on RSO if an action contains more than 1 argument
RS00210 The "Description and Recommendations" part of the RTS schema table are missing
RS00219 BIRT sample report not displaying rule artifact's documentation
RS00224 rule project which has rule task with a label starting with "<" cannot be published to RTS
RS00228 DT action definition "set <variable> to <a simple date>" loses the date type format when publishing from RS to RTS
RS00229 bytecode generation fails on java.util.Arrays.asList()
RS00234 B2X in sequential mode fails on .class access to XOM
RS00240 Ruleset builder fail to generate archive with default charset set to Japanese
RS00250 NPE when publishing DT from RTS to RSO
RS00254 Synchro RTS: Cannot update RuleDoc when hierarchy option is used without artifact in the root
RS00264 NoSuchMethodError with JIT enabled
RS00271 Invalid tests evaluation in not condition
RS00289 parser error listener memory leak in ruleflow
RS00299 memory leak when releasing a ruleset : message handlers on reflect cannot be removed
RS00302 Imported schema with the same namespace as its grand-parent leads to StackOverflowError
RS00325 IlrMergeWizard$CannotMergeException when a fqn is present twice in object model with different types
RS00335 Attribute label not migrated correctly from 6.7 to 7.x when used in Decision Table
RS00344 NPE in IlrBOMChecker while building workspace
RS00346 IlrSessionController::onCommitElement API doc incomplete
RS00347 Typo in Javadoc for ilog.rules.teamserver.model.IlrSession.beginUsage()
RS00348 serverrulegovernance build file error
RS00361 The "Project Security" link of the teamserver IlrSession interface API page is broken
RS00366 DT action cell auto-fill does not generate consistent precision for double/float value
RS00370 Provide the documentation for getter and setter methods of ilog.webui.dhtml.components.IlxWList
RS00372 FastPath optimization fails when rules conditions are using Enum classes
RS00377 BAL Localization: Portuguese mistranslation of "bigger than"
RS00381 RTS doesn't limit results of query with AND/OR operators on DTs as decided
RS00383 Same note appears twice in the Excel scenario files doc page
RS00395 Boot BOM b2x file has no UUID
RS00400 Typo error in the doc
RS00403 Sequential parsing of rules with expression having numerous parenthesis is very slow
RS00445 Exceptions are not documented in the doc of ilog.rules.teamserver.model.SessionListener
RS00456 "Rule engine API and ruleset files" doc page contains an incomplete line.
RS00485 RSO: DecisionTable: Cannot paste Action sub-column cell
RS00488 Date format is not applied on action column using the placeholder a simple date value
RS00489 ArrayIndexOutOfBoundsException during context creation
RS00495 Exception in the guided editor when switching bom members both using a domain
RS00496 MTDS in WasCE throws ClassNotFoundException when sequential mode is used
RS00500 Error when adding dynamic XOM and creating BOM entry with a schema which contains both import and include tags
RS00504 Run query actions is not always enabled when it should
RS00514 IlrJitterException when debugging a ruleset using Sequential tasks
RS00519 RTWARN003 is thrown when marshalling an XML input where a simple type element contains namespace declaration attribute
RS00524 Unable to check-in Excel ruledoc to RTS when a change is unsaved
RS00533 XOM file generated by dynamic xsds is found incorrect upon published to RTS
RS00554 Localized Studio displays a red squiggle under "Otherwise" branch label of decision trees
RS00577 A Variable not found exception is thrown when executing a well formed ruleset
RS00584 incremental IRL parser errors can cause OOM
RS00588 "javax.naming.NotContextException: jdbc/resdatasource" running j2eerulesession sample with 'Java Rule Session' on WAS CE
RS00589 Decision Table's cell dropdown list does not respect the constraint wrt the previous cell's value.
RS00597 Performance issue when creating a definition in the guided editor with big value domains
RS00599 Migrated ruleflow from 6.X to 7.X shows error when its diagram is grouped
RS00607 RSO: Ruleflow cannot be edited if its name contains an ampersand ('&')
RS00609 Advanced properties of a rule project are not synchronized
RS00625 RTS synchro in Studio does not take into account hosts excluded from http proxing set by Eclipse Network Connection preference option
RS00628 "ruleflows which may select this rule" query does not find rules if a subflow is present
RS00632 Wrong translation of bql.ProjectElement.createdByMe()#sentence.navigation in bql_ja.voc
RS00658 Cannot write and execute query to set value of an enumeration rule property to ' '
RS00659 DT rendering in preview fails with blank columns and row spans
RS00665 NPE when using JRules2dotnet and rules that use arrays
RS00683 [JRules2.Net] When there is a domain in a BOM processed by the JRules2.Net tool, the tool crashes
RS00685 Ruleflow build and display time grows exponentially with the number of nested fork/join
RS00686 [JRules2.net] Cannot generate a ruleset when rules use the BAL utility classes
RS00687 [JRules2.net] Cannot find execution class 'ilog.rules.brl.System' error when using JRules2DotNet convert tool
RS00689 Carriage Return are not escaped when pasted in a DT Cell, leading to loss of cell value when DT content is converted from one locale to another
RS00693 Cancelling automatic synchronization at Studio startup causes further synchronizations to fail
RS00694 NullPointerException when using dynamicselect and rule overriding in Sequential mode
RS00737 Improper sorting of concept instances in guided editor
RS00738 NullPointerException when deleting row of decision table in RTS
RS00740 engine configuration rule project property cannot be reset in RTS
RS00743 Endless loop when generating a ruleset
RS00752 Rule which tests a collection not fired using Fastpath algorithm
RS00784 IlrJitterException when using alias variables within fastpath and with keyword in
RS00787 Calling parseFileName during the execution stop it

Decision Center
PB00088 RTS schema creation script for DB2 9.x on z/OS should use explicit database reference
RS00001 Ruleflow irl cache is not cleared when a rule or a rulePackage from a dependent project is updated
RS00190 NPE thrown when generating task / rule report
RS00248 "Generate Task / Rule Report" will throw an NPE when Rule Task ID contains "&"
RS00279 ClassCastException when running "ruleflow may select" query
RS00287 UnauthorizedSessionRequestException in RTS with WAS session "Security integration" enabled
RS00321 RTS: When a row contains an empty cell following the Otherwise cell in the middle of a DT, the subsequent row is misaligned
RS00331 Deleting "set <select a variable> to <enter a value> + <enter a value>" results in ilog.rules.brl.ASTNodeNotFound error
RS00343 DT differences are not displayed properly when a change introduced an overlap
RS00350 Unable to edit condition with complex DT expression involving a "and" operator in RTS DT editor
RS00357 IlrSessionHelper.newTag() throws InstantiationException
RS00367 The drop-down menu of the Guided Editor is not correctly updated after changing the categories
RS00369 Editing a rule in a disply locale on an incomplete vocabulary breaks the server
RS00376 Enabling trace for teamserver breaks RTS
RS00379 Long delay when logging into RTS after server reboot for the first time
RS00385 Ruleflow IRL can be incorrectly generated when using several project dependancies
RS00410 Rule body lost when editing rules with guided editor in RTS
RS00446 Migrated smart views cannot be deleted
RS00447 [DVS] High memory consumption when BOM conversion generates warnings
RS00457 "View Ruleset Parameters" shows parameters for the wrong project
RS00459 Problem entering YearMonth in DVS
RS00461 New tab layout not properly handled in IE6.0
RS00465 Parsing of rule may fail as variables are not found following a specific scenario
RS00473 RTS Compilation errors if bom entry does not have .voc file for default RTS locale
RS00484 Absolute URL in the ruleflow/dtree details page
RS00490 RTS "View Ruleset Parameters" shows the parameters of previous rule project unless user logs in again
RS00506 Carriage return characters in rule documentation are skipped in the generated HTML reports
RS00517 Guided Editor in RS and RTS: Korean verbalizer is missing some tokens : "is more than" "is less than" etc
RS00522 Unable to edit the BAL rule in RTS if the rule contains verbalization //
RS00525 Possible failure to install the RTS schema on DB2 when the datasource username is less than 8 characters
RS00528 NPE when retrieving HTTP session on WAS7
RS00536 RTS: missing tooltips in web Intellirule editor
RS00539 RTS: HTML Report: Documentation is wrapped and loose formatting
RS00555 Specify that Custom Extensions have to be chosen if initializing database after running SQL script outside the Installation Manager
RS00557 Display of Ruleset property (monitoring.filters) value is truncated in RTS
RS00568 decision tree seems editable even with no permission to update content
RS00569 Some input streams are not closed and may fill up the process file descriptors table.
RS00570 Long warning message in RTS pages do not wrap and cause distortion to the display
RS00574 RTS locks not retrieved if number of locked elements is greater than or equal to 500
RS00582 Empty drop down list in DVS excel scenario file for domain with one item
RS00586 NPE in RTS when pressing "Escape" key while editing a decision table cell
RS00587 In Copy Action the Rule Package Selector never returns the new name of a rule package
RS00598 NPE when clicking twice on a tab link in RTS
RS00600 categories selection update not reflected in web rule editor
RS00608 Ruleset properties are always extracted as String from RTS
RS00614 Preferences with true for default value cannot be set to false
RS00641 Improper handling of Alt+Tab in Intellirule editor
RS00648 Stack running a DVS scenario in Studio when user doesn't have admin rights
RS00648 Stack running a DVS scenario in Studio when user doesn't have admin rights
RS00653 Reduce the size of the server response to guided editor actions
RS00662 Cannot generate ruleset containing a folder with a '$' in its name from RTS
RS00669 Impossible to install RTS on DB2 9.7 when the SQL Script uses BOOLEAN
RS00672 RTS throws error on generating large reports
RS00704 Memory leak on tomcat when restarting teamserver
RS00708 Deadlock may occur when several users concurrently create baseline and generate ruleset
RS00715 Unexpected delay when navigating away from the DT comparison page
RS00732 redeploy may fail with ruleset errors when deploy did not
RS00746 NullPointerException when clicking on RTS Query tab when browser language changed
RS00755 IllegalArgumenException executing a DVS scenario when ruleset has an array of dynamic complex type as OUT parameter
RS00760 StringIndexOutOfBoundsException when editing a text cell
RS00768 RTS user creating/editing a rule artifact is not warned of invalid property value when clicking on left-hand tabs instead of the wizard buttons
RS00773 ilog.rules.rsm.setup.ssp.IlrXOM implements two alternative protocols for Ant tasks incoherently
RS00778 Erase project function is very slow if the database contains many baseline dependencies
RS00781 Impossible to delete a faulty smart view from the query tab
RS00782 Categories are not sorted alphabetically in the rule editor in RTS
RS00789 Migration of Db2 zOS RTS database fails with an SQLCODE = -811
RS00792 "SQLException: Invalid column name" in RTS with Oracle when modifying a test suite by changing the input excel file with another that has the same name
RS00803 Vulnerability with project not found error
RS00805 DVS performance issue when a simulation contains a lot of scenarios
RS00807 Cancelling "New Query" in RTS does not return to previous screen
RS00813 NotSerializableException: ilog.rules.brl.IlrBRLMarker when generating a ruleset with an error in ruleflow

Event Designer
IZ82798 WAS V7 shipped/installed with WBE V7 in Japanese locale does not include NLS support.
IZ86524 WBE installation requires root user to perform installation. A non-root user can not perform installation.
IV00466 The Installation manager install/import fails with userinst command.
IZ84908 WBE Information Center cluster configuration instructions need correction/changes.
IZ92242 The WebSphere Business Events javascript tester tool has been withdrawn from the product but it is still mentioned in the product information center and the tool URI is still accessible.
IV08119 WBE INFO CENTER DOES NOT MENTION THE NECESSARY STEP OF CREATING MQ QUEUES ON THE QMGR WHEN MQ IS USED AS THE JMS PROVIDER
IZ88269 WBE DASHBOARD CHARTS DOUBLE COUNTING EVENTS
IZ91514 DESIGN WIDGET DOESN'T MAINTAIN ITS FULL STATE WHEN SWITCHING PAGES.
IZ94070 WBE Tester only shows one element when an action object is repeated
IZ96129 The project disappears from Design widget in Business space when switching pages with chart manager.
IV10114 BMWFR0007E when clicking from 1 tab to another in Business Space console
IZ96970 NullPointerException thrown when events are received by WBE non-supportpac SOAP event connector if it is disabled when using the WBE VP01 supportpac
IZ96973 BEER0567I and BEER0569I messages output when starting connectors with non-supportpac connectors disabled by the VP01 supportpac.
IV01692: IV01692 DISABLED TECHNOLOGY CONNECTORS ARE NOT LOGGED
IV02923 JDBC connectors loose an event even though the logs show they are monitoring for the events
IV05532 ACTION DATA CAN BE LOST WHEN THE ENHANCED CONNECTOR APPLICATIONS JMS CONNECTOR FAILS TO SEND A JMS MESSAGE FOR THE ACTION
IV11170 SYSTEM OBJECTS NOT RETURNING ANY INFORMATION IF WE HAVE MORE THAN ONE OF THEM IN A WBE PROJECT FILE.
IV11254 WBE TRIES TO OBTAIN ADDITIONAL CONNECTIONS WITHIN THE SAME TRANSACTION
IZ97787 WESB event emitter does not work with a WBE cluster
IV00765 Customers are not warned that a JRules Source is not the best way to obtain information from JRules

Event Runtime
IZ91162 HISTORY PURGE DOES NOT HAPPEN AS EXPECTED IF PURGE INTERVAL IS SET.
IZ92338 JAVA.LANG.CLASSNOTFOUNDEXCEPTION AS WAS IS UNAWARE OF SEVERAL JAR FILES DEFINED IN THE WBERUNTIME.JAR, MENIFEST.MF
IZ92160 WBE CALL TO JRULES FAILS FOR SPECIFIC JRULES STRUCTURES
IZ92161 BEEW5004E: publish project: failed to publish project, undefined" error when publishing project to runtime.
IZ94473 Problems when generating a Synthetic Event from an event containing multiple objects with array
IZ95759 SPORADIC FWK005 JAVA.LANG.NULLPOINTEREXCEPTION WHILE PROCESSING PAYLOADS
IZ97792 Using delayed events the number of events retrieved from DB is not limited
IZ98846 MQ JMS configuration scripts not working properly on non-Windows platforms
IV00333 configuration script for MQ messaging isn't correct for dmgr augmentation
IV00405 Message fails during schema validation when using XSD created by WBE
IV01737 When submitting events from WPS into WBE, WBE gets an additional event
IV03079 WBE report times one hour behind user provided value
IV07893 The script configure_MQ_JMS_messaging.py script does not use the channel names to create the activation specifications.
IV09812 SELECT FILTER GENERATES AN ARRAYINDEXOUTOFBOUNDSEXCEPTION WHEN COMPARING AN ARRAY AGAINST A SCALAR
IV11195 When using Oracle 11g R2 as WebSphere Business Events 7.0.1.1's Repository, ArrayIndexOutOfBoundsExceptions can be thrown.
IV11551 NullPointerException discovered when WebSphere Business Events built an action object from an 'if-selected' Intermediate Object and a non-if-selected Intermediate Object.

Rate this page:

(0 users)Average rating

Add comments

Document information


More support for:

IBM Operational Decision Manager
Upgrading

Software version:

7.5, 7.5.0.1, 7.5.0.2, 7.5.0.3, 7.5.0.4, 8.0, 8.0.0.1, 8.0.1, 8.0.1.1, 8.0.1.2, 8.5, 8.5.1, 8.5.1.1, 8.6

Operating system(s):

Platform Independent

Reference #:

7023767

Modified date:

2014-09-02

Translate my page

Machine Translation

Content navigation