PM81683: Exit action code in a state causes build errors because of no variables of rtg_list and rtg_count

Subscribe to this APAR

By subscribing, you receive periodic emails alerting you to the status of the APAR, along with a link to the fix after it becomes available. You can track this item individually or track all items by product.

Notify me when this APAR changes.

Notify me when an APAR for this component changes.

APAR status

  • Closed as program error.

Error description

  • event1()?:
    ../Class2.cpp:41:13: error: ?rtg_list? was not declared in this
    scope
    ../Class2.cpp:41:23: error: ?rtg_count? was not declared in this
    scope
    make: *** [Class2.o] Error 1
    

Local fix

Problem summary

  • ****************************************************************
    * USERS AFFECTED:                                              *
    ****************************************************************
    * PROBLEM DESCRIPTION:                                         *
    ****************************************************************
    * RECOMMENDATION:                                              *
    ****************************************************************
    Exit action code in a state causes build errors because of
    no variables of rtg_list and rtg_count
    

Problem conclusion

  • Correcteed RTC++ transformations to correctly generate code
    for passive class statemachines containing exit actions and
    sub-states.
    Now rtg_list and rtg_count variables will be properly
    generated when they are required.
    

Temporary fix

Comments

APAR Information

  • APAR number

    PM81683

  • Reported component name

    RSA REALTIME

  • Reported component ID

    5724G4701

  • Reported release

    851

  • Status

    CLOSED PER

  • PE

    NoPE

  • HIPER

    NoHIPER

  • Special Attention

    NoSpecatt

  • Submitted date

    2013-01-29

  • Closed date

    2014-04-10

  • Last modified date

    2014-04-10

  • APAR is sysrouted FROM one or more of the following:

  • APAR is sysrouted TO one or more of the following:

Fix information

  • Fixed component name

    RSA REALTIME

  • Fixed component ID

    5724G4701

Applicable component levels

  • R851 PSN

       UP



Rate this page:

(0 users)Average rating

Add comments

Document information


More support for:

Rational Software Architect RealTime Edition

Software version:

8.5.1

Reference #:

PM81683

Modified date:

2014-04-10

Translate my page

Machine Translation

Content navigation